<?xml version="1.0" encoding="UTF-8" standalone="yes" ?>
<!DOCTYPE bugzilla SYSTEM "https://bugzilla.yoctoproject.org/page.cgi?id=bugzilla.dtd">

<bugzilla version="5.0.6"
          urlbase="https://bugzilla.yoctoproject.org/"
          
          maintainer="it-coreprojects-helpdesk@linuxfoundation.org"
>

    <bug>
          <bug_id>10339</bug_id>
          
          <creation_ts>2016-09-28 08:57:51 +0000</creation_ts>
          <short_desc>Fedora24 builder fails oe-selftest with &quot;AssertionError: This test needs GnuPG&quot;</short_desc>
          <delta_ts>2016-10-04 19:58:19 +0000</delta_ts>
          <reporter_accessible>1</reporter_accessible>
          <cclist_accessible>1</cclist_accessible>
          <classification_id>5</classification_id>
          <classification>Infrastructure</classification>
          <product>AutoBuilder</product>
          <component>autobuilder</component>
          <version>2.2</version>
          <rep_platform>x86</rep_platform>
          <op_sys>Multiple</op_sys>
          <bug_status>RESOLVED</bug_status>
          <resolution>FIXED</resolution>
          
          
          <bug_file_loc></bug_file_loc>
          <status_whiteboard></status_whiteboard>
          <keywords></keywords>
          <priority>High</priority>
          <bug_severity>normal</bug_severity>
          <target_milestone>2.2 M4</target_milestone>
          
          
          <everconfirmed>1</everconfirmed>
          <reporter name="Joshua Lock">joshuagloe</reporter>
          <assigned_to name="Michael Halstead">mhalstead</assigned_to>
          <cc>infras.ab.watcher</cc>
    
    <cc>Infras.watcher</cc>
    
    <cc>pidge</cc>
          
          
          <cf_os>---</cf_os>
          <cf_regression_type>---</cf_regression_type>
          
          <cf_docchange>No (bug/feature does not impact docs)</cf_docchange>

      

      

      

          <comment_sort_order>oldest_to_newest</comment_sort_order>  
          <long_desc isprivate="0" >
    <commentid>66668</commentid>
    <comment_count>0</comment_count>
    <who name="Joshua Lock">joshuagloe</who>
    <bug_when>2016-09-28 08:57:51 +0000</bug_when>
    <thetext>A nighlty-oe-selftest build failed on the fedora24 builder due to the absence of gnupg. We need to install gnupg on the fedora24 builder.

We should probably make sure it&apos;s installed on machines in the new cluster too.</thetext>
  </long_desc><long_desc isprivate="0" >
    <commentid>66868</commentid>
    <comment_count>1</comment_count>
    <who name="Joshua Lock">joshuagloe</who>
    <bug_when>2016-10-04 15:56:35 +0000</bug_when>
    <thetext>The failing build was: 

https://autobuilder.yoctoproject.org/main/builders/nightly-oe-selftest/builds/693/steps/Running%20oe-selftest/logs/stdio

======================================================================
ERROR: setUpClass (oeqa.selftest.signing.Signing)
----------------------------------------------------------------------
Traceback (most recent call last):
  File &quot;/home/pokybuild/yocto-autobuilder/yocto-worker/nightly-oe-selftest/build/meta/lib/oeqa/selftest/signing.py&quot;, line 22, in setUpClass
    raise AssertionError(&quot;This test needs GnuPG&quot;)
AssertionError: This test needs GnuPG

However all builders, including Fedora24, already have gpg installed. On f24 /usr/bin/gpg and /usr/bin/gpg2 are present.

Self assigning this so that I can try and repro on a local f24 machine.</thetext>
  </long_desc><long_desc isprivate="0" >
    <commentid>66894</commentid>
    <comment_count>2</comment_count>
    <who name="Joshua Lock">joshuagloe</who>
    <bug_when>2016-10-04 19:58:19 +0000</bug_when>
    <thetext>Miscommunication between Michael and myself. gnupg install date was 2016-09-30, so we shouldn&apos;t see this error on Fedora 24 in future.</thetext>
  </long_desc>
      
      

    </bug>

</bugzilla>