<?xml version="1.0" encoding="UTF-8" standalone="yes" ?>
<!DOCTYPE bugzilla SYSTEM "https://bugzilla.yoctoproject.org/page.cgi?id=bugzilla.dtd">

<bugzilla version="5.0.6"
          urlbase="https://bugzilla.yoctoproject.org/"
          
          maintainer="it-coreprojects-helpdesk@linuxfoundation.org"
>

    <bug>
          <bug_id>10647</bug_id>
          
          <creation_ts>2016-11-11 16:41:09 +0000</creation_ts>
          <short_desc>core-image-minimal: do_testsdkext failed</short_desc>
          <delta_ts>2017-03-14 20:39:28 +0000</delta_ts>
          <reporter_accessible>1</reporter_accessible>
          <cclist_accessible>1</cclist_accessible>
          <classification_id>7</classification_id>
          <classification>Build System, Metadata &amp; Runtime</classification>
          <product>OE-Core</product>
          <component>devtools / tool chain</component>
          <version>2.3</version>
          <rep_platform>x86</rep_platform>
          <op_sys>Multiple</op_sys>
          <bug_status>VERIFIED</bug_status>
          <resolution>FIXED</resolution>
          
          
          <bug_file_loc></bug_file_loc>
          <status_whiteboard></status_whiteboard>
          <keywords></keywords>
          <priority>Medium+</priority>
          <bug_severity>major</bug_severity>
          <target_milestone>2.3 M3</target_milestone>
          
          <blocked>10693</blocked>
          <everconfirmed>1</everconfirmed>
          <reporter name="Robert Yang">liezhi.yang</reporter>
          <assigned_to name="Francisco Pedraza">francisco.j.pedraza.gonzalez</assigned_to>
          <cc>francisco.j.pedraza.gonzalez</cc>
    
    <cc>jose.perez.carranza</cc>
    
    <cc>meta.mr.watcher</cc>
    
    <cc>meta.watcher</cc>
    
    <cc>sonia.delgado</cc>
          
          <qa_contact name="Jose Perez C">jose.perez.carranza</qa_contact>
          <cf_os>---</cf_os>
          <cf_regression_type>---</cf_regression_type>
          
          <cf_docchange>Don&apos;t know</cf_docchange>

      

      

      

          <comment_sort_order>oldest_to_newest</comment_sort_order>  
          <long_desc isprivate="0" >
    <commentid>68257</commentid>
    <comment_count>0</comment_count>
    <who name="Robert Yang">liezhi.yang</who>
    <bug_when>2016-11-11 16:41:09 +0000</bug_when>
    <thetext>MACHINE = &quot;qemux86-64&quot;

$ bitbake core-image-minimal -cpopulate_sdk_ext
$ bitbake core-image-minimal -ctestsdkext

core-image-minimal-1.0-r0 do_testsdkext: test_cvs (oeqa.sdk.buildcvs.BuildCvsTest) ... ok
core-image-minimal-1.0-r0 do_testsdkext: skipped &quot;buildgalculator: Image doesn&apos;t have gtk+3 in manifest&quot;
core-image-minimal-1.0-r0 do_testsdkext: test_iptables (oeqa.sdk.buildiptables.BuildIptablesTest) ... ok
core-image-minimal-1.0-r0 do_testsdkext: skipped &quot;gcc: SDK doesn&apos;t contain a cross-canadian toolchain&quot;
core-image-minimal-1.0-r0 do_testsdkext: skipped &apos;perl: No perl package in the SDK&apos;
core-image-minimal-1.0-r0 do_testsdkext: skipped &apos;python: No python package in the SDK&apos;
core-image-minimal-1.0-r0 do_testsdkext:
core-image-minimal-1.0-r0 do_testsdkext: ----------------------------------------------------------------------
core-image-minimal-1.0-r0 do_testsdkext: Ran 2 tests in 88.399s
core-image-minimal-1.0-r0 do_testsdkext:
core-image-minimal-1.0-r0 do_testsdkext: OK (skipped=4)
core-image-minimal-1.0-r0 do_testsdkext: core-image-minimal SDK(poky-glibc-x86_64-core-image-minimal-core2-64-toolchain-ext-2.2.sh):environment-setup-core2-64-poky-linux - Ran 2 tests in 88.400s
core-image-minimal-1.0-r0 do_testsdkext: core-image-minimal - OK - All required tests passed (skipped=4)
core-image-minimal-1.0-r0 do_testsdkext: Testing /buildarea/lyang1/test_po/tmp/work/qemux86_64-poky-linux/core-image-minimal/1.0-r0/testsdkext//tc/environment-setup-x86-pokymllib32-linux
core-image-minimal-1.0-r0 do_testsdkext: test_cvs (oeqa.sdk.buildcvs.BuildCvsTest) ... FAIL
core-image-minimal-1.0-r0 do_testsdkext: skipped &quot;buildgalculator: Image doesn&apos;t have gtk+3 in manifest&quot;
core-image-minimal-1.0-r0 do_testsdkext: test_iptables (oeqa.sdk.buildiptables.BuildIptablesTest) ... FAIL
core-image-minimal-1.0-r0 do_testsdkext: skipped &quot;gcc: SDK doesn&apos;t contain a cross-canadian toolchain&quot;
core-image-minimal-1.0-r0 do_testsdkext: skipped &apos;perl: No perl package in the SDK&apos;
core-image-minimal-1.0-r0 do_testsdkext: skipped &apos;python: No python package in the SDK&apos;
core-image-minimal-1.0-r0 do_testsdkext:
core-image-minimal-1.0-r0 do_testsdkext: ======================================================================
core-image-minimal-1.0-r0 do_testsdkext: FAIL: test_cvs (oeqa.sdk.buildcvs.BuildCvsTest)
core-image-minimal-1.0-r0 do_testsdkext: ----------------------------------------------------------------------
core-image-minimal-1.0-r0 do_testsdkext: Traceback (most recent call last):
core-image-minimal-1.0-r0 do_testsdkext: Traceback (most recent call last):
  File &quot;/buildarea/lyang1/poky/meta/lib/oeqa/sdk/buildcvs.py&quot;, line 15, in test_cvs
    msg=&quot;Running configure failed&quot;)
AssertionError: 77 != 0 : Running configure failed
core-image-minimal-1.0-r0 do_testsdkext:
core-image-minimal-1.0-r0 do_testsdkext: ======================================================================
core-image-minimal-1.0-r0 do_testsdkext: FAIL: test_iptables (oeqa.sdk.buildiptables.BuildIptablesTest)
core-image-minimal-1.0-r0 do_testsdkext: ----------------------------------------------------------------------
core-image-minimal-1.0-r0 do_testsdkext: Traceback (most recent call last):
  File &quot;/buildarea/lyang1/poky/meta/lib/oeqa/sdk/buildiptables.py&quot;, line 16, in test_iptables
    msg=&quot;Running configure failed&quot;)
AssertionError: 77 != 0 : Running configure failed
core-image-minimal-1.0-r0 do_testsdkext:
core-image-minimal-1.0-r0 do_testsdkext: ----------------------------------------------------------------------
core-image-minimal-1.0-r0 do_testsdkext: Ran 2 tests in 6.425s
core-image-minimal-1.0-r0 do_testsdkext:
core-image-minimal-1.0-r0 do_testsdkext: FAILED (failures=2, skipped=4)
ERROR: core-image-minimal-1.0-r0 do_testsdkext: core-image-minimal - FAILED - check the task log and the commands log
ERROR: core-image-minimal-1.0-r0 do_testsdkext: Function failed: do_testsdkext</thetext>
  </long_desc><long_desc isprivate="0" >
    <commentid>68269</commentid>
    <comment_count>1</comment_count>
    <who name="Robert Yang">liezhi.yang</who>
    <bug_when>2016-11-14 09:41:42 +0000</bug_when>
    <thetext>BTW, this only happens when multilib is enabled:

require conf/multilib.conf
MULTILIBS = &quot;multilib:lib32&quot;
DEFAULTTUNE_virtclass-multilib-lib32 = &quot;x86&quot;</thetext>
  </long_desc><long_desc isprivate="0" >
    <commentid>68408</commentid>
    <comment_count>2</comment_count>
    <who name="Richard Purdie">richard.purdie</who>
    <bug_when>2016-11-17 15:57:33 +0000</bug_when>
    <thetext>Wondering if we&apos;re missing a test case for multilib eSDK on the autobuilder too? If we are that should be a separate bug.</thetext>
  </long_desc><long_desc isprivate="0" >
    <commentid>68436</commentid>
    <comment_count>3</comment_count>
    <who name="Robert Yang">liezhi.yang</who>
    <bug_when>2016-11-18 09:01:50 +0000</bug_when>
    <thetext>Yes, indeed, filed a bug for automated runtime testing:

https://bugzilla.yoctoproject.org/show_bug.cgi?id=10693</thetext>
  </long_desc><long_desc isprivate="0" >
    <commentid>70307</commentid>
    <comment_count>4</comment_count>
    <who name="Francisco Pedraza">francisco.j.pedraza.gonzalez</who>
    <bug_when>2017-01-31 21:45:57 +0000</bug_when>
    <thetext>(In reply to comment #3)
&gt; Yes, indeed, filed a bug for automated runtime testing:
&gt; 
&gt; https://bugzilla.yoctoproject.org/show_bug.cgi?id=10693

Hi Robert,
Any update on this?
Regards</thetext>
  </long_desc><long_desc isprivate="0" >
    <commentid>70382</commentid>
    <comment_count>5</comment_count>
    <who name="Leonardo Sandoval Gonzalez">leonardo.sandoval.gonzalez</who>
    <bug_when>2017-02-02 16:22:03 +0000</bug_when>
    <thetext>(In reply to comment #4)
&gt; (In reply to comment #3)
&gt; &gt; Yes, indeed, filed a bug for automated runtime testing:
&gt; &gt; 
&gt; &gt; https://bugzilla.yoctoproject.org/show_bug.cgi?id=10693
&gt; 
&gt; Hi Robert,
&gt; Any update on this?
&gt; Regards

Paco, can you execute the steps again on latest master&apos;s HEAD? This may be already working.</thetext>
  </long_desc><long_desc isprivate="0" >
    <commentid>70439</commentid>
    <comment_count>6</comment_count>
    <who name="Francisco Pedraza">francisco.j.pedraza.gonzalez</who>
    <bug_when>2017-02-04 17:31:52 +0000</bug_when>
    <thetext>(In reply to comment #5)
&gt; (In reply to comment #4)
&gt; &gt; (In reply to comment #3)
&gt; &gt; &gt; Yes, indeed, filed a bug for automated runtime testing:
&gt; &gt; &gt; 
&gt; &gt; &gt; https://bugzilla.yoctoproject.org/show_bug.cgi?id=10693
&gt; &gt; 
&gt; &gt; Hi Robert,
&gt; &gt; Any update on this?
&gt; &gt; Regards
&gt; 
&gt; Paco, can you execute the steps again on latest master&apos;s HEAD? This may be
&gt; already working.

OK Leo, working on it.</thetext>
  </long_desc><long_desc isprivate="0" >
    <commentid>70441</commentid>
    <comment_count>7</comment_count>
    <who name="Francisco Pedraza">francisco.j.pedraza.gonzalez</who>
    <bug_when>2017-02-04 17:52:59 +0000</bug_when>
    <thetext>I just tested this one, and is working good.
core-image-minimal-1.0-r0 do_testsdkext: GccCompileTest class: SDK doesn&apos;t contain a cross-canadian toolchain
core-image-minimal-1.0-r0 do_testsdkext: RESULTS - perl.PerlTest.test_perl_exists - Testcase -1: SKIPPED
core-image-minimal-1.0-r0 do_testsdkext: No perl package in the SDK
core-image-minimal-1.0-r0 do_testsdkext: RESULTS - perl.PerlTest.test_perl_works - Testcase -1: SKIPPED
core-image-minimal-1.0-r0 do_testsdkext: No perl package in the SDK
core-image-minimal-1.0-r0 do_testsdkext: RESULTS - python.PythonTest.test_python_exists - Testcase -1: SKIPPED
core-image-minimal-1.0-r0 do_testsdkext: No python package in the SDK
core-image-minimal-1.0-r0 do_testsdkext: RESULTS - python.PythonTest.test_python_stdout - Testcase -1: SKIPPED
core-image-minimal-1.0-r0 do_testsdkext: No python package in the SDK
core-image-minimal-1.0-r0 do_testsdkext: RESULTS - python.PythonTest.test_python_testfile - Testcase -1: SKIPPED
core-image-minimal-1.0-r0 do_testsdkext: No python package in the SDK
core-image-minimal-1.0-r0 do_testsdkext: RESULTS - devtool.DevtoolTest.test_devtool_add_reset - Testcase -1: PASSED
core-image-minimal-1.0-r0 do_testsdkext: RESULTS - devtool.DevtoolTest.test_devtool_build_cmake - Testcase 1479: PASSED
core-image-minimal-1.0-r0 do_testsdkext: RESULTS - devtool.DevtoolTest.test_devtool_build_esdk_package - Testcase 1474: PASSED
core-image-minimal-1.0-r0 do_testsdkext: RESULTS - devtool.DevtoolTest.test_devtool_build_make - Testcase 1473: PASSED
core-image-minimal-1.0-r0 do_testsdkext: RESULTS - devtool.DevtoolTest.test_devtool_kernelmodule - Testcase 1484: PASSED
core-image-minimal-1.0-r0 do_testsdkext: RESULTS - devtool.DevtoolTest.test_devtool_location - Testcase -1: PASSED
core-image-minimal-1.0-r0 do_testsdkext: RESULTS - devtool.DevtoolTest.test_extend_autotools_recipe_creation - Testcase 1482: PASSED
core-image-minimal-1.0-r0 do_testsdkext: RESULTS - devtool.DevtoolTest.test_recipes_for_nodejs - Testcase 1478: PASSED
core-image-minimal-1.0-r0 do_testsdkext: RESULTS - sdk_update.SdkUpdateTest.test_sdk_update_http - Testcase -1: PASSED
NOTE: Tasks Summary: Attempted 1 tasks of which 0 didn&apos;t need to be rerun and all succeeded.</thetext>
  </long_desc><long_desc isprivate="0" >
    <commentid>71284</commentid>
    <comment_count>8</comment_count>
    <who name="Jose Perez C">jose.perez.carranza</who>
    <bug_when>2017-03-14 20:39:28 +0000</bug_when>
    <thetext>As per Comment 7 this is working correctly</thetext>
  </long_desc>
      
      

    </bug>

</bugzilla>