<?xml version="1.0" encoding="UTF-8" standalone="yes" ?>
<!DOCTYPE bugzilla SYSTEM "https://bugzilla.yoctoproject.org/page.cgi?id=bugzilla.dtd">

<bugzilla version="5.0.6"
          urlbase="https://bugzilla.yoctoproject.org/"
          
          maintainer="it-coreprojects-helpdesk@linuxfoundation.org"
>

    <bug>
          <bug_id>1113</bug_id>
          
          <creation_ts>2011-05-27 00:55:23 +0000</creation_ts>
          <short_desc>sudoku-savant compile failed in qemux86-64 sdk image</short_desc>
          <delta_ts>2011-06-01 10:39:21 +0000</delta_ts>
          <reporter_accessible>1</reporter_accessible>
          <cclist_accessible>1</cclist_accessible>
          <classification_id>6</classification_id>
          <classification>Yocto Project Subprojects</classification>
          <product>ADT</product>
          <component>adt</component>
          <version>1.0</version>
          <rep_platform>x86</rep_platform>
          <op_sys>Multiple</op_sys>
          <bug_status>RESOLVED</bug_status>
          <resolution>WONTFIX</resolution>
          
          
          <bug_file_loc></bug_file_loc>
          <status_whiteboard></status_whiteboard>
          <keywords></keywords>
          <priority>Medium</priority>
          <bug_severity>normal</bug_severity>
          <target_milestone>1.1 M2</target_milestone>
          
          
          <everconfirmed>1</everconfirmed>
          <reporter name="Jiajun Xu">jiajun.xu</reporter>
          <assigned_to name="liping Ke">liping.ke</assigned_to>
          <cc>jessica.zhang</cc>
    
    <cc>ke.yu</cc>
    
    <cc>lianhao.lu</cc>
    
    <cc>liping.ke</cc>
    
    <cc>poky.adt.watcher</cc>
    
    <cc>poky.watcher</cc>
          
          
          <cf_os>---</cf_os>
          <cf_regression_type>---</cf_regression_type>
          
          <cf_docchange>---</cf_docchange>

      

      

      

          <comment_sort_order>oldest_to_newest</comment_sort_order>  
          <long_desc isprivate="0" >
    <commentid>14028</commentid>
    <comment_count>0</comment_count>
    <who name="Jiajun Xu">jiajun.xu</who>
    <bug_when>2011-05-27 00:55:23 +0000</bug_when>
    <thetext>tree/branch: poky/1.1_M1
commit: fc55b224caa3eeac4abda099ec9ed505db59fb28
image location: all qemux86-64 images for 1.1_M1 RC1 http://autobuilder03.jf.intel.com/nightly/20110520-1/machines/qemu

With Yocto 1.1 M1 RC1 build, sudoku-savant compile failed in qemux86-64 sdk image. We do not have such test before. So I have no idea if it&apos;s a new bug or regression.

Error log as below:
##########
make  all-recursive
make[1]: Entering directory `/home/root/sudoku-savant-1.3&apos;
Making all in src
make[2]: Entering directory `/home/root/sudoku-savant-1.3/src&apos;
g++ -DHAVE_CONFIG_H -I. -I.. -DPACKAGE_DATA_DIR=\&quot;&quot;/usr/local/share&quot;\&quot; -DPACKAGE_LOCALE_DIR=\&quot;&quot;/usr/local/share/locale&quot;\&quot; -pthread -I/usr/include/gtk-2.0 -I/usr/lib/gtk-2.0/include -I/usr/include/atk-1.0 -I/usr/include/cairo -I/usr/include/gdk-pixbuf-2.0 -I/usr/include/pango-1.0 -I/usr/include/glib-2.0 -I/usr/lib/glib-2.0/include -I/usr/include/pixman-1 -I/usr/include/freetype2 -I/usr/include/libpng12     -frepo -fno-implement-inlines -ansi -pedantic -pipe -Wall -Winline -Wshadow -Wsign-compare -Woverloaded-virtual -Wextra --param max-inline-insns-single=400 -g -O2 -MT document.o -MD -MP -MF .deps/document.Tpo -c -o document.o document.cpp
{standard input}: Assembler messages:
{standard input}:75159: Warning: end of file not at end of a line; newline inserted
g++: internal compiler error: Killed (program cc1plus)
Please submit a full bug report,
with preprocessed source if appropriate.
See &lt;http://gcc.gnu.org/bugs.html&gt; for instructions.
make[2]: *** [document.o] Error 4
make[2]: Leaving directory `/home/root/sudoku-savant-1.3/src&apos;
make[1]: *** [all-recursive] Error 1
make[1]: Leaving directory `/home/root/sudoku-savant-1.3&apos;
make: *** [all] Error 2
##########</thetext>
  </long_desc><long_desc isprivate="0" >
    <commentid>14063</commentid>
    <comment_count>1</comment_count>
    <who name="liping Ke">liping.ke</who>
    <bug_when>2011-05-29 18:52:28 +0000</bug_when>
    <thetext>This is a known issue from 1.0 release (Or even 0.9 release)
In target qemu, we have slim chances to successfully build a bigger project, always Internal Error with GCC. In 0.9, with bigger memory assignment for qemu, it might be ok. But in 1.0, even I assign 512M for i586 qemu, I still have higher rate of failure.

Thanks&amp; Regards,
criping

(In reply to comment #0)
&gt; tree/branch: poky/1.1_M1
&gt; commit: fc55b224caa3eeac4abda099ec9ed505db59fb28
&gt; image location: all qemux86-64 images for 1.1_M1 RC1
&gt; http://autobuilder03.jf.intel.com/nightly/20110520-1/machines/qemu
&gt; 
&gt; With Yocto 1.1 M1 RC1 build, sudoku-savant compile failed in qemux86-64 sdk
&gt; image. We do not have such test before. So I have no idea if it&apos;s a new bug or
&gt; regression.
&gt; 
&gt; Error log as below:
&gt; ##########
&gt; make  all-recursive
&gt; make[1]: Entering directory `/home/root/sudoku-savant-1.3&apos;
&gt; Making all in src
&gt; make[2]: Entering directory `/home/root/sudoku-savant-1.3/src&apos;
&gt; g++ -DHAVE_CONFIG_H -I. -I.. -DPACKAGE_DATA_DIR=\&quot;&quot;/usr/local/share&quot;\&quot;
&gt; -DPACKAGE_LOCALE_DIR=\&quot;&quot;/usr/local/share/locale&quot;\&quot; -pthread
&gt; -I/usr/include/gtk-2.0 -I/usr/lib/gtk-2.0/include -I/usr/include/atk-1.0
&gt; -I/usr/include/cairo -I/usr/include/gdk-pixbuf-2.0 -I/usr/include/pango-1.0
&gt; -I/usr/include/glib-2.0 -I/usr/lib/glib-2.0/include -I/usr/include/pixman-1
&gt; -I/usr/include/freetype2 -I/usr/include/libpng12     -frepo
&gt; -fno-implement-inlines -ansi -pedantic -pipe -Wall -Winline -Wshadow
&gt; -Wsign-compare -Woverloaded-virtual -Wextra --param max-inline-insns-single=400
&gt; -g -O2 -MT document.o -MD -MP -MF .deps/document.Tpo -c -o document.o
&gt; document.cpp
&gt; {standard input}: Assembler messages:
&gt; {standard input}:75159: Warning: end of file not at end of a line; newline
&gt; inserted
&gt; g++: internal compiler error: Killed (program cc1plus)
&gt; Please submit a full bug report,
&gt; with preprocessed source if appropriate.
&gt; See &lt;http://gcc.gnu.org/bugs.html&gt; for instructions.
&gt; make[2]: *** [document.o] Error 4
&gt; make[2]: Leaving directory `/home/root/sudoku-savant-1.3/src&apos;
&gt; make[1]: *** [all-recursive] Error 1
&gt; make[1]: Leaving directory `/home/root/sudoku-savant-1.3&apos;
&gt; make: *** [all] Error 2
&gt; ##########</thetext>
  </long_desc><long_desc isprivate="0" >
    <commentid>14079</commentid>
    <comment_count>2</comment_count>
    <who name="Jiajun Xu">jiajun.xu</who>
    <bug_when>2011-05-31 08:01:09 +0000</bug_when>
    <thetext>After discussion with Liping, we decide not to test cvs/iptables/sudoku in qemu target becasue qemu is limited by memory and cpu.</thetext>
  </long_desc><long_desc isprivate="0" >
    <commentid>14120</commentid>
    <comment_count>3</comment_count>
    <who name="Jessica">jessica.zhang</who>
    <bug_when>2011-06-01 10:39:21 +0000</bug_when>
    <thetext>Per latest comments</thetext>
  </long_desc>
      
      

    </bug>

</bugzilla>