<?xml version="1.0" encoding="UTF-8" standalone="yes" ?>
<!DOCTYPE bugzilla SYSTEM "https://bugzilla.yoctoproject.org/page.cgi?id=bugzilla.dtd">

<bugzilla version="5.0.6"
          urlbase="https://bugzilla.yoctoproject.org/"
          
          maintainer="it-coreprojects-helpdesk@linuxfoundation.org"
>

    <bug>
          <bug_id>11419</bug_id>
          
          <creation_ts>2017-04-26 17:13:23 +0000</creation_ts>
          <short_desc>[Test Case 1565] Test bitbake-selftest</short_desc>
          <delta_ts>2017-04-27 15:12:17 +0000</delta_ts>
          <reporter_accessible>1</reporter_accessible>
          <cclist_accessible>1</cclist_accessible>
          <classification_id>7</classification_id>
          <classification>Build System, Metadata &amp; Runtime</classification>
          <product>BitBake</product>
          <component>bitbake</component>
          <version>2.3</version>
          <rep_platform>x86</rep_platform>
          <op_sys>Multiple</op_sys>
          <bug_status>RESOLVED</bug_status>
          <resolution>WORKSFORME</resolution>
          
          
          <bug_file_loc></bug_file_loc>
          <status_whiteboard></status_whiteboard>
          <keywords></keywords>
          <priority>Undecided</priority>
          <bug_severity>normal</bug_severity>
          <target_milestone>---</target_milestone>
          
          
          <everconfirmed>1</everconfirmed>
          <reporter name="oscar lopez arandas">oscarx.lopez.arandas</reporter>
          <assigned_to name="Richard Purdie">richard.purdie</assigned_to>
          <cc>jose.perez.carranza</cc>
    
    <cc>poky.bs.watcher</cc>
    
    <cc>poky.watcher</cc>
          
          
          <cf_os>---</cf_os>
          <cf_regression_type>---</cf_regression_type>
          
          <cf_docchange>No (bug/feature does not impact docs)</cf_docchange>

      

      

      

          <comment_sort_order>oldest_to_newest</comment_sort_order>  
          <long_desc isprivate="0" >
    <commentid>72867</commentid>
    <comment_count>0</comment_count>
    <who name="oscar lopez arandas">oscarx.lopez.arandas</who>
    <bug_when>2017-04-26 17:13:23 +0000</bug_when>
    <thetext>STATUS: IDLE
BUILD: 2.3 M4: rc2-7a0e795373653886452a7a2992ced10080711c26
ENVIRONMENT:  &quot;x86_64-linux&quot;
STEPS TO REPRODUCE: 
1- $ clone poky
2- $ cd poky
3- $ source oe-init-build-env
4- $ bitbake-selftest


EXPECTED OUTCOME:   All test cases are executed and no errors are reported.

ACTUAL OUTCOME: FAILED (failures=2)

NOTES: results

oscar@oscar-ThinkPad-T540p:~/1565/build$ bitbake-selftest
............................................................................................................................................................FF................................................................
======================================================================
FAIL: test_wget_checkstatus (bb.tests.fetch.FetchCheckStatusTest)
----------------------------------------------------------------------
Traceback (most recent call last):
  File &quot;/home/oscar/1565/bitbake/lib/bb/tests/fetch.py&quot;, line 838, in test_wget_checkstatus
    self.assertTrue(ret, msg=&quot;URI %s, can&apos;t check status&quot; % (u))
AssertionError: False is not true : URI ftp://ftp.gnu.org/gnu/autoconf/autoconf-2.60.tar.gz, can&apos;t check status

======================================================================
FAIL: test_wget_checkstatus_connection_cache (bb.tests.fetch.FetchCheckStatusTest)
----------------------------------------------------------------------
Traceback (most recent call last):
  File &quot;/home/oscar/1565/bitbake/lib/bb/tests/fetch.py&quot;, line 852, in test_wget_checkstatus_connection_cache
    self.assertTrue(ret, msg=&quot;URI %s, can&apos;t check status&quot; % (u))
AssertionError: False is not true : URI ftp://ftp.gnu.org/gnu/autoconf/autoconf-2.60.tar.gz, can&apos;t check status

----------------------------------------------------------------------
Ran 222 tests in 826.251s

FAILED (failures=2)</thetext>
  </long_desc><long_desc isprivate="0" >
    <commentid>72896</commentid>
    <comment_count>1</comment_count>
    <who name="Richard Purdie">richard.purdie</who>
    <bug_when>2017-04-27 14:52:37 +0000</bug_when>
    <thetext>I tested this myself:

$ bitbake-selftest
..............................................................................................................................................................................................................................
----------------------------------------------------------------------
Ran 222 tests in 204.095s

OK

I therefore believe either you have a local network issue, or there was a problem with the remote server when you ran the test. I don&apos;t believe there is any issue within bitbake which is what we&apos;d be concerned about.</thetext>
  </long_desc><long_desc isprivate="0" >
    <commentid>72902</commentid>
    <comment_count>2</comment_count>
    <who name="Jose Perez C">jose.perez.carranza</who>
    <bug_when>2017-04-27 15:12:17 +0000</bug_when>
    <thetext>Seems like yesterday the site was down, I ran it today in 3 different networks and everything worked correctly.</thetext>
  </long_desc>
      
      

    </bug>

</bugzilla>