<?xml version="1.0" encoding="UTF-8" standalone="yes" ?>
<!DOCTYPE bugzilla SYSTEM "https://bugzilla.yoctoproject.org/page.cgi?id=bugzilla.dtd">

<bugzilla version="5.0.6"
          urlbase="https://bugzilla.yoctoproject.org/"
          
          maintainer="it-coreprojects-helpdesk@linuxfoundation.org"
>

    <bug>
          <bug_id>11641</bug_id>
          
          <creation_ts>2017-06-09 16:27:51 +0000</creation_ts>
          <short_desc>test_integrity_compressed_images oe-selftest failed</short_desc>
          <delta_ts>2017-06-09 16:33:27 +0000</delta_ts>
          <reporter_accessible>1</reporter_accessible>
          <cclist_accessible>1</cclist_accessible>
          <classification_id>7</classification_id>
          <classification>Build System, Metadata &amp; Runtime</classification>
          <product>OE-Core</product>
          <component>core</component>
          <version>2.4</version>
          <rep_platform>x86</rep_platform>
          <op_sys>Multiple</op_sys>
          <bug_status>RESOLVED</bug_status>
          <resolution>OBSOLETE</resolution>
          
          
          <bug_file_loc></bug_file_loc>
          <status_whiteboard></status_whiteboard>
          <keywords></keywords>
          <priority>Undecided</priority>
          <bug_severity>normal</bug_severity>
          <target_milestone>---</target_milestone>
          
          
          <everconfirmed>1</everconfirmed>
          <reporter name="Todor Minchev">todor.minchev</reporter>
          <assigned_to name="Ross Burton">ross.burton</assigned_to>
          <cc>meta.mr.watcher</cc>
    
    <cc>meta.watcher</cc>
          
          
          <cf_os>---</cf_os>
          <cf_regression_type>---</cf_regression_type>
          
          <cf_docchange>No (bug/feature does not impact docs)</cf_docchange>

      

      

      

          <comment_sort_order>oldest_to_newest</comment_sort_order>  
          <long_desc isprivate="0" >
    <commentid>73947</commentid>
    <comment_count>0</comment_count>
    <who name="Todor Minchev">todor.minchev</who>
    <bug_when>2017-06-09 16:27:51 +0000</bug_when>
    <thetext>https://autobuilder.yoctoproject.org/main/builders/nightly-oe-selftest/builds/911/steps/Running%20oe-selftest/logs/stdio

2017-06-08 09:22:49,268 - oe-selftest - INFO - ======================================================================
2017-06-08 09:22:49,268 - oe-selftest - INFO - FAIL [124.260s]: test_integrity_compressed_images (runtime_test.GeneratedImages)
2017-06-08 09:22:49,268 - oe-selftest - INFO - ----------------------------------------------------------------------
2017-06-08 09:22:49,268 - oe-selftest - INFO - Traceback (most recent call last):
  File &quot;/home/pokybuild/yocto-autobuilder/yocto-worker/nightly-oe-selftest/build/meta/lib/oeqa/core/decorator/__init__.py&quot;, line 32, in wrapped_f
    return func(*args, **kwargs)
  File &quot;/home/pokybuild/yocto-autobuilder/yocto-worker/nightly-oe-selftest/build/meta/lib/oeqa/selftest/cases/runtime_test.py&quot;, line 277, in test_integrity_compressed_images
    bitbake(build)
  File &quot;/home/pokybuild/yocto-autobuilder/yocto-worker/nightly-oe-selftest/build/meta/lib/oeqa/utils/commands.py&quot;, line 150, in bitbake
    return runCmd(cmd, ignore_status, timeout, **options)
  File &quot;/home/pokybuild/yocto-autobuilder/yocto-worker/nightly-oe-selftest/build/meta/lib/oeqa/utils/commands.py&quot;, line 128, in runCmd
    raise AssertionError(&quot;Command &apos;%s&apos; returned non-zero exit status %d:\n%s&quot; % (command, result.status, exc_output))
AssertionError: Command &apos;bitbake  core-image-minimal&apos; returned non-zero exit status 1:
Parsing recipes...done.</thetext>
  </long_desc><long_desc isprivate="0" >
    <commentid>73949</commentid>
    <comment_count>1</comment_count>
    <who name="Ross Burton">ross.burton</who>
    <bug_when>2017-06-09 16:33:27 +0000</bug_when>
    <thetext>Already yanked from MUT.</thetext>
  </long_desc>
      
      

    </bug>

</bugzilla>