<?xml version="1.0" encoding="UTF-8" standalone="yes" ?>
<!DOCTYPE bugzilla SYSTEM "https://bugzilla.yoctoproject.org/page.cgi?id=bugzilla.dtd">

<bugzilla version="5.0.6"
          urlbase="https://bugzilla.yoctoproject.org/"
          
          maintainer="it-coreprojects-helpdesk@linuxfoundation.org"
>

    <bug>
          <bug_id>11973</bug_id>
          
          <creation_ts>2017-08-24 12:08:18 +0000</creation_ts>
          <short_desc>BB_SERVER_TIMEOUT causes testsdkext failures</short_desc>
          <delta_ts>2021-09-22 17:31:25 +0000</delta_ts>
          <reporter_accessible>1</reporter_accessible>
          <cclist_accessible>1</cclist_accessible>
          <classification_id>6</classification_id>
          <classification>Yocto Project Subprojects</classification>
          <product>eSDK</product>
          <component>eSDK</component>
          <version>unspecified</version>
          <rep_platform>x86</rep_platform>
          <op_sys>Multiple</op_sys>
          <bug_status>RESOLVED</bug_status>
          <resolution>FIXED</resolution>
          
          
          <bug_file_loc></bug_file_loc>
          <status_whiteboard></status_whiteboard>
          <keywords></keywords>
          <priority>Medium</priority>
          <bug_severity>normal</bug_severity>
          <target_milestone>Future</target_milestone>
          
          
          <everconfirmed>1</everconfirmed>
          <reporter name="Richard Purdie">richard.purdie</reporter>
          <assigned_to name="Richard Purdie">richard.purdie</assigned_to>
          <cc>oscarx.lopez.arandas</cc>
    
    <cc>stephano</cc>
    
    <cc>wmills</cc>
          
          <qa_contact name="Francisco Pedraza">francisco.j.pedraza.gonzalez</qa_contact>
          <cf_os>---</cf_os>
          <cf_regression_type>---</cf_regression_type>
          
          <cf_docchange>No (bug/feature does not impact docs)</cf_docchange>

      

      

      

          <comment_sort_order>oldest_to_newest</comment_sort_order>  
          <long_desc isprivate="0" >
    <commentid>76120</commentid>
    <comment_count>0</comment_count>
    <who name="Richard Purdie">richard.purdie</who>
    <bug_when>2017-08-24 12:08:18 +0000</bug_when>
    <thetext>If you set BB_SERVER_TIMEOUT=10, build an eSDK (bitbake core-image-minimal -c populate_sdk_ext), then test it (bitbake core-image-minimal -c testsdkext) then it fails. Locally I saw:

$ bitbake core-image-minimal -c testsdkext
NOTE: Reconnecting to bitbake server...
Loading cache: 100% |##########################################################################################################################################| Time: 0:00:00
Loaded 1290 entries from dependency cache.
NOTE: Resolving any missing task queue dependencies

Build Configuration:
BB_VERSION        = &quot;1.35.0&quot;
BUILD_SYS         = &quot;x86_64-linux&quot;
NATIVELSBSTRING   = &quot;universal&quot;
TARGET_SYS        = &quot;mips-poky-linux&quot;
MACHINE           = &quot;qemumips&quot;
DISTRO            = &quot;poky&quot;
DISTRO_VERSION    = &quot;2.3&quot;
TUNE_FEATURES     = &quot;o32 bigendian fpu-hard mips32r2&quot;
TARGET_FPU        = &quot;&quot;
meta              
meta-poky         
meta-yocto-bsp    = &quot;wip:362d6e0490b2ab9a0e9eecbc6c5eb63f2eb83533&quot;
meta-mingw        = &quot;master:0679d2a91575bd7f3efd0973aa99d7ee681e9395&quot;
meta-selftest     = &quot;wip:362d6e0490b2ab9a0e9eecbc6c5eb63f2eb83533&quot;

Initialising tasks: 100% |#####################################################################################################################################| Time: 0:00:02
NOTE: Executing RunQueue Tasks
Extensible SDK testing environment: mips32r2-poky-linux
THREAD: 139990289868544
----------------------------------------------------------------------

Running tests...
----------------------------------------------------------------------

----------------------------------------------------------------------
Ran 0 tests in 0.001s

OK (skipped=1)

Generating XML reports...

THREAD: 139990527887104
----------------------------------------------------------------------

Running tests...
----------------------------------------------------------------------

----------------------------------------------------------------------
Ran 0 tests in 0.000s

OK (skipped=1)

Generating XML reports...

THREAD: 139990298261248
----------------------------------------------------------------------

Running tests...
----------------------------------------------------------------------
  test_perl_exists (perl.PerlTest) ... OK (0.014s)
  test_perl_works (perl.PerlTest) ... OK (0.017s)

----------------------------------------------------------------------
Ran 2 tests in 0.034s

OK

Generating XML reports...

THREAD: 139990511101696
----------------------------------------------------------------------

Running tests...
----------------------------------------------------------------------
  test_gcc_compile (gcc.GccCompileTest) ... OK (0.064s)
  test_gpp2_compile (gcc.GccCompileTest) ... OK (0.071s)
  test_gpp_compile (gcc.GccCompileTest) ... OK (0.099s)
  test_make (gcc.GccCompileTest) ... OK (0.059s)

----------------------------------------------------------------------
Ran 4 tests in 0.305s

OK

Generating XML reports...

THREAD: 139990519494400
----------------------------------------------------------------------

Running tests...
----------------------------------------------------------------------
  test_lzip (buildlzip.BuildLzipTest) ... OK (4.291s)

----------------------------------------------------------------------
Ran 1 test in 4.330s

OK

Generating XML reports...

THREAD: 139990767052544
----------------------------------------------------------------------

Running tests...
----------------------------------------------------------------------
  test_cpio (buildcpio.BuildCpioTest) ... OK (52.939s)

----------------------------------------------------------------------
Ran 1 test in 53.465s

OK

Generating XML reports...

THREAD: 139990281475840
----------------------------------------------------------------------

Running tests...
----------------------------------------------------------------------
  test_devtool_location (devtool.DevtoolTest) ... OK (0.008s)
  test_devtool_add_reset (devtool.DevtoolTest) ... OK (7.104s)
  test_devtool_build_cmake (devtool.DevtoolTest) ... OK (30.998s)
  test_devtool_build_esdk_package (devtool.DevtoolTest) ... OK (15.581s)
  test_devtool_build_make (devtool.DevtoolTest) ... OK (16.802s)
  test_devtool_kernelmodule (devtool.DevtoolTest) ... OK (121.021s)
  test_extend_autotools_recipe_creation (devtool.DevtoolTest) ... OK (43.555s)
  test_recipes_for_nodejs (devtool.DevtoolTest) ... OK (4.555s)
  test_sdk_update_http (devtool.SdkUpdateTest) ... ERROR (15.812s)

======================================================================
ERROR [15.812s]: test_sdk_update_http (devtool.SdkUpdateTest)
----------------------------------------------------------------------
Traceback (most recent call last):
  File &quot;/media/build1/poky/meta/lib/oeqa/sdkext/cases/devtool.py&quot;, line 124, in test_sdk_update_http
    output = self._run(&quot;devtool sdk-update \&quot;%s\&quot;&quot; % self.http_url)
  File &quot;/media/build1/poky/meta/lib/oeqa/sdkext/case.py&quot;, line 21, in _run
    shell=True, env=env, universal_newlines=True)
  File &quot;/usr/lib/python3.5/subprocess.py&quot;, line 626, in check_output
    **kwargs).stdout
  File &quot;/usr/lib/python3.5/subprocess.py&quot;, line 708, in run
    output=stdout, stderr=stderr)
oeqa.utils.subprocesstweak.OETestCalledProcessError: Command &apos;. /media/build1/poky/build/tmp/work/qemumips-poky-linux/core-image-minimal/1.0-r0/testsdkext/environment-setup-mips32r2-poky-linux &gt; /dev/null; devtool sdk-update &quot;http://127.0.0.1:41569&quot;;&apos; returned non-zero exit status 255
Standard Output: NOTE: Starting bitbake server...
NOTE: Reconnecting to bitbake server...
Cloning into &apos;layers&apos;...
NOTE: Preparing build system... (This may take some time.)
ERROR: Preparation failed:
NOTE: Reconnecting to bitbake server...
Loading cache...done.
Loaded 1290 entries from dependency cache.
Parsing recipes...done.
Parsing of 835 .bb files complete (0 cached, 835 parsed). 1290 targets, 74 skipped, 0 masked, 0 errors.
NOTE: Resolving any missing task queue dependencies
Initialising tasks...ERROR: An uncaught exception occurred in runqueue
Traceback (most recent call last):
  File &quot;/media/build1/poky/build/tmp/work/qemumips-poky-linux/core-image-minimal/1.0-r0/testsdkext/layers/poky/bitbake/lib/bb/runqueue.py&quot;, line 1375, in execute_runqueue
    return self._execute_runqueue()
  File &quot;/media/build1/poky/build/tmp/work/qemumips-poky-linux/core-image-minimal/1.0-r0/testsdkext/layers/poky/bitbake/lib/bb/runqueue.py&quot;, line 1315, in _execute_runqueue
    self.start_worker()
  File &quot;/media/build1/poky/build/tmp/work/qemumips-poky-linux/core-image-minimal/1.0-r0/testsdkext/layers/poky/bitbake/lib/bb/runqueue.py&quot;, line 1169, in start_worker
    self.worker[mc] = self._start_worker(mc)
  File &quot;/media/build1/poky/build/tmp/work/qemumips-poky-linux/core-image-minimal/1.0-r0/testsdkext/layers/poky/bitbake/lib/bb/runqueue.py&quot;, line 1115, in _start_worker
    worker = subprocess.Popen([&quot;bitbake-worker&quot;, magic], stdout=subprocess.PIPE, stdin=subprocess.PIPE)
  File &quot;/media/build1/poky/build/tmp/work/qemumips-poky-linux/core-image-minimal/1.0-r0/testsdkext/buildtools/sysroots/x86_64-pokysdk-linux/usr/lib/python3.5/subprocess.py&quot;, line 676, in __init__
    restore_signals, start_new_session)
  File &quot;/media/build1/poky/build/tmp/work/qemumips-poky-linux/core-image-minimal/1.0-r0/testsdkext/buildtools/sysroots/x86_64-pokysdk-linux/usr/lib/python3.5/subprocess.py&quot;, line 1282, in _execute_child
    raise child_exception_type(errno_num, err_msg)
FileNotFoundError: [Errno 2] No such file or directory: &apos;bitbake-worker&apos;
Traceback (most recent call last):
  File &quot;/media/build1/poky/build/tmp/work/qemumips-poky-linux/core-image-minimal/1.0-r0/testsdkext/layers/poky/bitbake/lib/bb/runqueue.py&quot;, line 1315, in RunQueue._execute_runqueue():
                     self.rqdata.init_progress_reporter.next_stage()
    &gt;                self.start_worker()
                     self.rqdata.init_progress_reporter.next_stage()
  File &quot;/media/build1/poky/build/tmp/work/qemumips-poky-linux/core-image-minimal/1.0-r0/testsdkext/layers/poky/bitbake/lib/bb/runqueue.py&quot;, line 1169, in RunQueue.start_worker():
             for mc in self.rqdata.dataCaches:
    &gt;            self.worker[mc] = self._start_worker(mc)
     
  File &quot;/media/build1/poky/build/tmp/work/qemumips-poky-linux/core-image-minimal/1.0-r0/testsdkext/layers/poky/bitbake/lib/bb/runqueue.py&quot;, line 1115, in RunQueue._start_worker(mc=&apos;&apos;, fakeroot=False, rqexec=None):
             else:
    &gt;            worker = subprocess.Popen([&quot;bitbake-worker&quot;, magic], stdout=subprocess.PIPE, stdin=subprocess.PIPE)
             bb.utils.nonblockingfd(worker.stdout)
  File &quot;/media/build1/poky/build/tmp/work/qemumips-poky-linux/core-image-minimal/1.0-r0/testsdkext/buildtools/sysroots/x86_64-pokysdk-linux/usr/lib/python3.5/subprocess.py&quot;, line 676, in Popen.__init__(args=[&apos;bitbake-worker&apos;, &apos;decafbad&apos;], bufsize=-1, executable=None, stdin=-1, stdout=-1, stderr=None, preexec_fn=None, close_fds=True, shell=False, cwd=None, env=None, universal_newlines=False, startupinfo=None, creationflags=0, restore_signals=True, start_new_session=False, pass_fds=()):
                                     errread, errwrite,
    &gt;                                restore_signals, start_new_session)
             except:
  File &quot;/media/build1/poky/build/tmp/work/qemumips-poky-linux/core-image-minimal/1.0-r0/testsdkext/buildtools/sysroots/x86_64-pokysdk-linux/usr/lib/python3.5/subprocess.py&quot;, line 1282, in Popen._execute_child(args=[&apos;bitbake-worker&apos;, &apos;decafbad&apos;], executable=b&apos;bitbake-worker&apos;, preexec_fn=None, close_fds=True, pass_fds=(), cwd=None, env=None, startupinfo=None, creationflags=0, shell=False, p2cread=114, p2cwrite=115, c2pread=116, c2pwrite=117, errread=-1, errwrite=-1, restore_signals=True, start_new_session=False):
                                     err_msg += &apos;: &apos; + repr(orig_executable)
    &gt;                    raise child_exception_type(errno_num, err_msg)
                     raise child_exception_type(err_msg)
FileNotFoundError: [Errno 2] No such file or directory: &apos;bitbake-worker&apos;

ERROR: Running idle function
Traceback (most recent call last):
  File &quot;/media/build1/poky/build/tmp/work/qemumips-poky-linux/core-image-minimal/1.0-r0/testsdkext/layers/poky/bitbake/lib/bb/server/process.py&quot;, line 270, in idle_commands
    retval = function(self, data, False)
  File &quot;/media/build1/poky/build/tmp/work/qemumips-poky-linux/core-image-minimal/1.0-r0/testsdkext/layers/poky/bitbake/lib/bb/cooker.py&quot;, line 1374, in buildTargetsIdle
    retval = rq.execute_runqueue()
  File &quot;/media/build1/poky/build/tmp/work/qemumips-poky-linux/core-image-minimal/1.0-r0/testsdkext/layers/poky/bitbake/lib/bb/runqueue.py&quot;, line 1375, in execute_runqueue
    return self._execute_runqueue()
  File &quot;/media/build1/poky/build/tmp/work/qemumips-poky-linux/core-image-minimal/1.0-r0/testsdkext/layers/poky/bitbake/lib/bb/runqueue.py&quot;, line 1315, in _execute_runqueue
    self.start_worker()
  File &quot;/media/build1/poky/build/tmp/work/qemumips-poky-linux/core-image-minimal/1.0-r0/testsdkext/layers/poky/bitbake/lib/bb/runqueue.py&quot;, line 1169, in start_worker
    self.worker[mc] = self._start_worker(mc)
  File &quot;/media/build1/poky/build/tmp/work/qemumips-poky-linux/core-image-minimal/1.0-r0/testsdkext/layers/poky/bitbake/lib/bb/runqueue.py&quot;, line 1115, in _start_worker
    worker = subprocess.Popen([&quot;bitbake-worker&quot;, magic], stdout=subprocess.PIPE, stdin=subprocess.PIPE)
  File &quot;/media/build1/poky/build/tmp/work/qemumips-poky-linux/core-image-minimal/1.0-r0/testsdkext/buildtools/sysroots/x86_64-pokysdk-linux/usr/lib/python3.5/subprocess.py&quot;, line 676, in __init__
    restore_signals, start_new_session)
  File &quot;/media/build1/poky/build/tmp/work/qemumips-poky-linux/core-image-minimal/1.0-r0/testsdkext/buildtools/sysroots/x86_64-pokysdk-linux/usr/lib/python3.5/subprocess.py&quot;, line 1282, in _execute_child
    raise child_exception_type(errno_num, err_msg)
FileNotFoundError: [Errno 2] No such file or directory: &apos;bitbake-worker&apos;
Traceback (most recent call last):
  File &quot;/media/build1/poky/build/tmp/work/qemumips-poky-linux/core-image-minimal/1.0-r0/testsdkext/layers/poky/bitbake/lib/bb/runqueue.py&quot;, line 1315, in RunQueue._execute_runqueue():
                     self.rqdata.init_progress_reporter.next_stage()
    &gt;                self.start_worker()
                     self.rqdata.init_progress_reporter.next_stage()
  File &quot;/media/build1/poky/build/tmp/work/qemumips-poky-linux/core-image-minimal/1.0-r0/testsdkext/layers/poky/bitbake/lib/bb/runqueue.py&quot;, line 1169, in RunQueue.start_worker():
             for mc in self.rqdata.dataCaches:
    &gt;            self.worker[mc] = self._start_worker(mc)
     
  File &quot;/media/build1/poky/build/tmp/work/qemumips-poky-linux/core-image-minimal/1.0-r0/testsdkext/layers/poky/bitbake/lib/bb/runqueue.py&quot;, line 1115, in RunQueue._start_worker(mc=&apos;&apos;, fakeroot=False, rqexec=None):
             else:
    &gt;            worker = subprocess.Popen([&quot;bitbake-worker&quot;, magic], stdout=subprocess.PIPE, stdin=subprocess.PIPE)
             bb.utils.nonblockingfd(worker.stdout)
  File &quot;/media/build1/poky/build/tmp/work/qemumips-poky-linux/core-image-minimal/1.0-r0/testsdkext/buildtools/sysroots/x86_64-pokysdk-linux/usr/lib/python3.5/subprocess.py&quot;, line 676, in Popen.__init__(args=[&apos;bitbake-worker&apos;, &apos;decafbad&apos;], bufsize=-1, executable=None, stdin=-1, stdout=-1, stderr=None, preexec_fn=None, close_fds=True, shell=False, cwd=None, env=None, universal_newlines=False, startupinfo=None, creationflags=0, restore_signals=True, start_new_session=False, pass_fds=()):
                                     errread, errwrite,
    &gt;                                restore_signals, start_new_session)
             except:
  File &quot;/media/build1/poky/build/tmp/work/qemumips-poky-linux/core-image-minimal/1.0-r0/testsdkext/buildtools/sysroots/x86_64-pokysdk-linux/usr/lib/python3.5/subprocess.py&quot;, line 1282, in Popen._execute_child(args=[&apos;bitbake-worker&apos;, &apos;decafbad&apos;], executable=b&apos;bitbake-worker&apos;, preexec_fn=None, close_fds=True, pass_fds=(), cwd=None, env=None, startupinfo=None, creationflags=0, shell=False, p2cread=114, p2cwrite=115, c2pread=116, c2pwrite=117, errread=-1, errwrite=-1, restore_signals=True, start_new_session=False):
                                     err_msg += &apos;: &apos; + repr(orig_executable)
    &gt;                    raise child_exception_type(errno_num, err_msg)
                     raise child_exception_type(err_msg)
FileNotFoundError: [Errno 2] No such file or directory: &apos;bitbake-worker&apos;


Summary: There were 2 ERROR messages shown, returning a non-zero exit code.



----------------------------------------------------------------------
Ran 9 tests in 286.471s

FAILED (errors=1)

Generating XML reports...

RESULTS:
RESULTS - buildcpio.BuildCpioTest.test_cpio - Testcase -1: PASSED
RESULTS - buildgalculator.GalculatorTest.test_galculator - Testcase -1: SKIPPED
RESULTS - buildlzip.BuildLzipTest.test_lzip - Testcase -1: PASSED
RESULTS - gcc.GccCompileTest.test_gcc_compile - Testcase -1: PASSED
RESULTS - gcc.GccCompileTest.test_gpp2_compile - Testcase -1: PASSED
RESULTS - gcc.GccCompileTest.test_gpp_compile - Testcase -1: PASSED
RESULTS - gcc.GccCompileTest.test_make - Testcase -1: PASSED
RESULTS - perl.PerlTest.test_perl_exists - Testcase -1: PASSED
RESULTS - perl.PerlTest.test_perl_works - Testcase -1: PASSED
RESULTS - python.PythonTest.test_python_exists - Testcase -1: SKIPPED
RESULTS - python.PythonTest.test_python_stdout - Testcase -1: SKIPPED
RESULTS - python.PythonTest.test_python_testfile - Testcase -1: SKIPPED
RESULTS - devtool.DevtoolTest.test_devtool_add_reset - Testcase -1: PASSED
RESULTS - devtool.DevtoolTest.test_devtool_build_cmake - Testcase 1607: PASSED
RESULTS - devtool.DevtoolTest.test_devtool_build_esdk_package - Testcase 1606: PASSED
RESULTS - devtool.DevtoolTest.test_devtool_build_make - Testcase 1605: PASSED
RESULTS - devtool.DevtoolTest.test_devtool_kernelmodule - Testcase 1609: PASSED
RESULTS - devtool.DevtoolTest.test_devtool_location - Testcase -1: PASSED
RESULTS - devtool.DevtoolTest.test_extend_autotools_recipe_creation - Testcase 1608: PASSED
RESULTS - devtool.DevtoolTest.test_recipes_for_nodejs - Testcase 1610: PASSED
RESULTS - devtool.SdkUpdateTest.test_sdk_update_http - Testcase -1: ERROR
SUMMARY:
core-image-minimal esdk (poky-glibc-x86_64-core-image-minimal-mips32r2-toolchain-ext-2.3.sh:environment-setup-mips32r2-poky-linux) - Ran 21 tests in 286.484s
core-image-minimal esdk - FAIL - Required tests failed
ERROR: core-image-minimal-1.0-r0 do_testsdkext: core-image-minimal - FAILED - check the task log and the commands log
ERROR: core-image-minimal-1.0-r0 do_testsdkext: Function failed: do_testsdkext
ERROR: Logfile of failure stored in: /media/build1/poky/build/tmp/work/qemumips-poky-linux/core-image-minimal/1.0-r0/temp/log.do_testsdkext.65719
ERROR: Task (/media/build1/poky/meta/recipes-core/images/core-image-minimal.bb:do_testsdkext) failed with exit code &apos;1&apos;
NOTE: Tasks Summary: Attempted 1 tasks of which 0 didn&apos;t need to be rerun and 1 failed.

Summary: 1 task failed:
  /media/build1/poky/meta/recipes-core/images/core-image-minimal.bb:do_testsdkext
Summary: There were 2 ERROR messages shown, returning a non-zero exit code.

There is also a report of:

2017-08-23 05:44:05 [post-build-test] NOTE: Tasks Summary: Attempted 82 tasks of which 26 didn&apos;t need to be rerun and all succeeded.
2017-08-23 05:44:05 [post-build-test] NOTE: Successfully installed meta-extsdk-toolchain
2017-08-23 05:44:05 [post-build-test] NOTE: Reconnecting to bitbake server...
2017-08-23 05:44:05 [post-build-test] Loading cache...done.
2017-08-23 05:44:05 [post-build-test] Loaded 3652 entries from dependency cache.
2017-08-23 05:44:05 [post-build-test] Parsing recipes...done.
2017-08-23 05:44:05 [post-build-test] Parsing of 2733 .bb files complete (2729 cached, 4 parsed). 3656 targets, 475 skipped, 1 masked, 0 errors.
2017-08-23 05:44:05 [post-build-test] NOTE: Resolving any missing task queue dependencies
2017-08-23 05:44:05 [post-build-test] Initialising tasks...NOTE: Checking active recipes
2017-08-23 05:44:05 [post-build-test] ERROR: An uncaught exception occurred in runqueue
2017-08-23 05:44:05 [post-build-test] Traceback (most recent call last):
2017-08-23 05:44:05 [post-build-test]   File &quot;/srv/jenkins/workspace/ci-2017-08-23_04-27-13-build-431/build/tmp-headless-glibc/work/intel_corei7_64-refkit-linux/refkit-image-gateway/1.0-r0/testsdkext/layers/openembedded-core/bitbake/lib/bb/runqueue.py&quot;, line 1375, in RunQueue.execute_runqueue():
2017-08-23 05:44:05 [post-build-test]              try:
2017-08-23 05:44:05 [post-build-test]     &gt;            return self._execute_runqueue()
2017-08-23 05:44:05 [post-build-test]              except bb.runqueue.TaskFailure:
2017-08-23 05:44:05 [post-build-test]   File &quot;/srv/jenkins/workspace/ci-2017-08-23_04-27-13-build-431/build/tmp-headless-glibc/work/intel_corei7_64-refkit-linux/refkit-image-gateway/1.0-r0/testsdkext/layers/openembedded-core/bitbake/lib/bb/runqueue.py&quot;, line 1351, in RunQueue._execute_runqueue():
2017-08-23 05:44:05 [post-build-test]                  self.teardown_workers()
2017-08-23 05:44:05 [post-build-test]     &gt;            if self.rqexe.stats.failed:
2017-08-23 05:44:05 [post-build-test]                      logger.info(&quot;Tasks Summary: Attempted %d tasks of which %d didn&apos;t need to be rerun and %d failed.&quot;, self.rqexe.stats.completed + self.rqexe.stats.failed, self.rqexe.stats.skipped, self.rqexe.stats.failed)
2017-08-23 05:44:05 [post-build-test] AttributeError: &apos;RunQueueExecuteScenequeue&apos; object has no attribute &apos;stats&apos;
2017-08-23 05:44:05 [post-build-test] 
2017-08-23 05:44:05 [post-build-test] ERROR: Running idle function
2017-08-23 05:44:05 [post-build-test] Traceback (most recent call last):
2017-08-23 05:44:05 [post-build-test]   File &quot;/srv/jenkins/workspace/ci-2017-08-23_04-27-13-build-431/build/tmp-headless-glibc/work/intel_corei7_64-refkit-linux/refkit-image-gateway/1.0-r0/testsdkext/layers/openembedded-core/bitbake/lib/bb/server/process.py&quot;, line 252, in ProcessServer.idle_commands(delay=0.10000000000000001, fds=[&lt;socket.socket fd=7, family=AddressFamily.AF_UNIX, type=SocketKind.SOCK_STREAM, proto=0, laddr=bitbake.sock&gt;, &lt;socket.socket fd=13, family=AddressFamily.AF_UNIX, type=SocketKind.SOCK_STREAM, proto=0, laddr=bitbake.sock&gt;, &lt;bb.server.process.ConnectionReader object at 0x7fd77907feb8&gt;]):
2017-08-23 05:44:05 [post-build-test]                  try:
2017-08-23 05:44:05 [post-build-test]     &gt;                retval = function(self, data, False)
2017-08-23 05:44:05 [post-build-test]                      if retval is False:
2017-08-23 05:44:05 [post-build-test]   File &quot;/srv/jenkins/workspace/ci-2017-08-23_04-27-13-build-431/build/tmp-headless-glibc/work/intel_corei7_64-refkit-linux/refkit-image-gateway/1.0-r0/testsdkext/layers/openembedded-core/bitbake/lib/bb/cooker.py&quot;, line 1364, in buildTargetsIdle(server=&lt;ProcessServer(ProcessServer-1, started)&gt;, rq=&lt;bb.runqueue.RunQueue object at 0x7fd77cc6c278&gt;, abort=False):
2017-08-23 05:44:05 [post-build-test]                  try:
2017-08-23 05:44:05 [post-build-test]     &gt;                retval = rq.execute_runqueue()
2017-08-23 05:44:05 [post-build-test]                  except runqueue.TaskFailure as exc:
2017-08-23 05:44:05 [post-build-test]   File &quot;/srv/jenkins/workspace/ci-2017-08-23_04-27-13-build-431/build/tmp-headless-glibc/work/intel_corei7_64-refkit-linux/refkit-image-gateway/1.0-r0/testsdkext/layers/openembedded-core/bitbake/lib/bb/runqueue.py&quot;, line 1375, in RunQueue.execute_runqueue():
2017-08-23 05:44:05 [post-build-test]              try:
2017-08-23 05:44:05 [post-build-test]     &gt;            return self._execute_runqueue()
2017-08-23 05:44:05 [post-build-test]              except bb.runqueue.TaskFailure:
2017-08-23 05:44:05 [post-build-test]   File &quot;/srv/jenkins/workspace/ci-2017-08-23_04-27-13-build-431/build/tmp-headless-glibc/work/intel_corei7_64-refkit-linux/refkit-image-gateway/1.0-r0/testsdkext/layers/openembedded-core/bitbake/lib/bb/runqueue.py&quot;, line 1351, in RunQueue._execute_runqueue():
2017-08-23 05:44:05 [post-build-test]                  self.teardown_workers()
2017-08-23 05:44:05 [post-build-test]     &gt;            if self.rqexe.stats.failed:
2017-08-23 05:44:05 [post-build-test]                      logger.info(&quot;Tasks Summary: Attempted %d tasks of which %d didn&apos;t need to be rerun and %d failed.&quot;, self.rqexe.stats.completed + self.rqexe.stats.failed, self.rqexe.stats.skipped, self.rqexe.stats.failed)
2017-08-23 05:44:05 [post-build-test] AttributeError: &apos;RunQueueExecuteScenequeue&apos; object has no attribute &apos;stats&apos;
2017-08-23 05:44:05 [post-build-test] 
2017-08-23 05:44:05 [post-build-test] 
2017-08-23 05:44:05 [post-build-test] Summary: There were 2 ERROR messages shown, returning a non-zero exit code.
2017-08-23 05:44:05 [post-build-test] ERROR: Failed to bitbake build-sysroots:
2017-08-23 05:44:05 [post-build-test] Execution of &apos;. /srv/jenkins/workspace/ci-2017-08-23_04-27-13-build-431/build/tmp-headless-glibc/work/intel_corei7_64-refkit-linux/refkit-image-gateway/1.0-r0/testsdkext/layers/openembedded-core/oe-init-build-env /srv/jenkins/workspace/ci-2017-08-23_04-27-13-build-431/build/tmp-headless-glibc/work/intel_corei7_64-refkit-linux/refkit-image-gateway/1.0-r0/testsdkext &gt; /dev/null &amp;&amp; bitbake build-sysroots&apos; failed with exit code 1:
2017-08-23 05:44:05 [post-build-test] NOTE: Reconnecting to bitbake server...
2017-08-23 05:44:05 [post-build-test] Loading cache...done.
2017-08-23 05:44:05 [post-build-test] Loaded 3652 entries from dependency cache.
2017-08-23 05:44:05 [post-build-test] Parsing recipes...done.
2017-08-23 05:44:05 [post-build-test] Parsing of 2733 .bb files complete (2729 cached, 4 parsed). 3656 targets, 475 skipped, 1 masked, 0 errors.
2017-08-23 05:44:05 [post-build-test] NOTE: Resolving any missing task queue dependencies
2017-08-23 05:44:05 [post-build-test] Initialising tasks...NOTE: Checking active recipes
2017-08-23 05:44:05 [post-build-test] ERROR: An uncaught exception occurred in runqueue
2017-08-23 05:44:05 [post-build-test] Traceback (most recent call last):
2017-08-23 05:44:05 [post-build-test]   File &quot;/srv/jenkins/workspace/ci-2017-08-23_04-27-13-build-431/build/tmp-headless-glibc/work/intel_corei7_64-refkit-linux/refkit-image-gateway/1.0-r0/testsdkext/layers/openembedded-core/bitbake/lib/bb/runqueue.py&quot;, line 1375, in RunQueue.execute_runqueue():
2017-08-23 05:44:05 [post-build-test]              try:
2017-08-23 05:44:05 [post-build-test]     &gt;            return self._execute_runqueue()
2017-08-23 05:44:05 [post-build-test]              except bb.runqueue.TaskFailure:
2017-08-23 05:44:05 [post-build-test]   File &quot;/srv/jenkins/workspace/ci-2017-08-23_04-27-13-build-431/build/tmp-headless-glibc/work/intel_corei7_64-refkit-linux/refkit-image-gateway/1.0-r0/testsdkext/layers/openembedded-core/bitbake/lib/bb/runqueue.py&quot;, line 1351, in RunQueue._execute_runqueue():
2017-08-23 05:44:05 [post-build-test]                  self.teardown_workers()
2017-08-23 05:44:05 [post-build-test]     &gt;            if self.rqexe.stats.failed:
2017-08-23 05:44:05 [post-build-test]                      logger.info(&quot;Tasks Summary: Attempted %d tasks of which %d didn&apos;t need to be rerun and %d failed.&quot;, self.rqexe.stats.completed + self.rqexe.stats.failed, self.rqexe.stats.skipped, self.rqexe.stats.failed)
2017-08-23 05:44:05 [post-build-test] AttributeError: &apos;RunQueueExecuteScenequeue&apos; object has no attribute &apos;stats&apos;
2017-08-23 05:44:05 [post-build-test] 
2017-08-23 05:44:05 [post-build-test] ERROR: Running idle function
2017-08-23 05:44:05 [post-build-test] Traceback (most recent call last):
2017-08-23 05:44:05 [post-build-test]   File &quot;/srv/jenkins/workspace/ci-2017-08-23_04-27-13-build-431/build/tmp-headless-glibc/work/intel_corei7_64-refkit-linux/refkit-image-gateway/1.0-r0/testsdkext/layers/openembedded-core/bitbake/lib/bb/server/process.py&quot;, line 252, in ProcessServer.idle_commands(delay=0.10000000000000001, fds=[&lt;socket.socket fd=7, family=AddressFamily.AF_UNIX, type=SocketKind.SOCK_STREAM, proto=0, laddr=bitbake.sock&gt;, &lt;socket.socket fd=13, family=AddressFamily.AF_UNIX, type=SocketKind.SOCK_STREAM, proto=0, laddr=bitbake.sock&gt;, &lt;bb.server.process.ConnectionReader object at 0x7fd77907feb8&gt;]):
2017-08-23 05:44:05 [post-build-test]                  try:
2017-08-23 05:44:05 [post-build-test]     &gt;                retval = function(self, data, False)
2017-08-23 05:44:05 [post-build-test]                      if retval is False:
2017-08-23 05:44:05 [post-build-test]   File &quot;/srv/jenkins/workspace/ci-2017-08-23_04-27-13-build-431/build/tmp-headless-glibc/work/intel_corei7_64-refkit-linux/refkit-image-gateway/1.0-r0/testsdkext/layers/openembedded-core/bitbake/lib/bb/cooker.py&quot;, line 1364, in buildTargetsIdle(server=&lt;ProcessServer(ProcessServer-1, started)&gt;, rq=&lt;bb.runqueue.RunQueue object at 0x7fd77cc6c278&gt;, abort=False):
2017-08-23 05:44:05 [post-build-test]                  try:
2017-08-23 05:44:05 [post-build-test]     &gt;                retval = rq.execute_runqueue()
2017-08-23 05:44:05 [post-build-test]                  except runqueue.TaskFailure as exc:
2017-08-23 05:44:05 [post-build-test]   File &quot;/srv/jenkins/workspace/ci-2017-08-23_04-27-13-build-431/build/tmp-headless-glibc/work/intel_corei7_64-refkit-linux/refkit-image-gateway/1.0-r0/testsdkext/layers/openembedded-core/bitbake/lib/bb/runqueue.py&quot;, line 1375, in RunQueue.execute_runqueue():
2017-08-23 05:44:05 [post-build-test]              try:
2017-08-23 05:44:05 [post-build-test]     &gt;            return self._execute_runqueue()
2017-08-23 05:44:05 [post-build-test]              except bb.runqueue.TaskFailure:
2017-08-23 05:44:05 [post-build-test]   File &quot;/srv/jenkins/workspace/ci-2017-08-23_04-27-13-build-431/build/tmp-headless-glibc/work/intel_corei7_64-refkit-linux/refkit-image-gateway/1.0-r0/testsdkext/layers/openembedded-core/bitbake/lib/bb/runqueue.py&quot;, line 1351, in RunQueue._execute_runqueue():
2017-08-23 05:44:05 [post-build-test]                  self.teardown_workers()
2017-08-23 05:44:05 [post-build-test]     &gt;            if self.rqexe.stats.failed:
2017-08-23 05:44:05 [post-build-test]                      logger.info(&quot;Tasks Summary: Attempted %d tasks of which %d didn&apos;t need to be rerun and %d failed.&quot;, self.rqexe.stats.completed + self.rqexe.stats.failed, self.rqexe.stats.skipped, self.rqexe.stats.failed)
2017-08-23 05:44:05 [post-build-test] AttributeError: &apos;RunQueueExecuteScenequeue&apos; object has no attribute &apos;stats&apos;
2017-08-23 05:44:05 [post-build-test] 
2017-08-23 05:44:05 [post-build-test] 
2017-08-23 05:44:05 [post-build-test] Summary: There were 2 ERROR messages shown, returning a non-zero exit code.

which I suspect is some kind of similar issue.</thetext>
  </long_desc><long_desc isprivate="0" >
    <commentid>76121</commentid>
    <comment_count>1</comment_count>
    <who name="Richard Purdie">richard.purdie</who>
    <bug_when>2017-08-24 12:09:21 +0000</bug_when>
    <thetext>Adding BB_SERVER_TIMEOUT to SDK_LOCAL_CONF_BLACKLIST worked around the first failure, second not as yet tested.</thetext>
  </long_desc><long_desc isprivate="0" >
    <commentid>76321</commentid>
    <comment_count>2</comment_count>
    <who name="Richard Purdie">richard.purdie</who>
    <bug_when>2017-08-30 13:56:19 +0000</bug_when>
    <thetext>Confirmed as fixing the second too. Merged the fix as a workaround to master whilst we look into and fix this properly.</thetext>
  </long_desc><long_desc isprivate="0" >
    <commentid>77786</commentid>
    <comment_count>3</comment_count>
    <who name="oscar lopez arandas">oscarx.lopez.arandas</who>
    <bug_when>2017-10-24 16:54:49 +0000</bug_when>
    <thetext>

    This bug is still present on  in  GDC autobuilder  ERROR: core-image-minimal-1.0-r0 do_testsdkext: Couldn&apos;t install the extensible SDK: but in diferent BBVERSION and DISTRO_VERSION.

Build Configuration:
BB_VERSION        = &quot;1.32.0&quot;
BUILD_SYS         = &quot;x86_64-linux&quot;
NATIVELSBSTRING   = &quot;universal&quot;
TARGET_SYS        = &quot;i586-poky-linux&quot;
MACHINE           = &quot;qemux86&quot;
DISTRO            = &quot;poky&quot;
DISTRO_VERSION    = &quot;2.2.2&quot;
TUNE_FEATURES     = &quot;m32 i586&quot;        
meta-yocto-bsp    = &quot;heads/morty:1d92cb1a20135cfffff9f94a6633ec0840518738&quot;
==============================================================================
ERROR: core-image-minimal-1.0-r0 do_testsdkext: Function failed: do_testsdkext
ERROR: Logfile of failure stored in: /home/ab/autobuilder/yocto-worker/nightly-x86/build/build/tmp/work/qemux86-poky-linux/core-image-minimal/1.0-r0/temp/log.do_testsdkext.22423
NOTE: recipe core-image-minimal-1.0-r0: task do_testsdkext: Failed
ERROR: Task (/home/ab/autobuilder/yocto-worker/nightly-x86/build/meta/recipes-core/images/core-image-minimal.bb:do_testsdkext) failed with exit code &apos;1&apos;
ERROR: core-image-sato-1.0-r0 do_testsdkext: Couldn&apos;t install the extensible SDK:
Poky (Yocto Project Reference Distro) Extensible SDK installer version 2.2.2
============================================================================
full-log in attachment</thetext>
  </long_desc><long_desc isprivate="0" >
    <commentid>77787</commentid>
    <comment_count>4</comment_count>
      <attachid>4095</attachid>
    <who name="oscar lopez arandas">oscarx.lopez.arandas</who>
    <bug_when>2017-10-24 16:55:29 +0000</bug_when>
    <thetext>Created attachment 4095
full_log</thetext>
  </long_desc><long_desc isprivate="0" >
    <commentid>88031</commentid>
    <comment_count>5</comment_count>
    <who name="Richard Purdie">richard.purdie</who>
    <bug_when>2020-08-25 11:14:52 +0000</bug_when>
    <thetext>The issue was the sys.argv references in runqueue used for BB_SETSCENE_ENFORCE. http://git.yoctoproject.org/cgit.cgi/poky/commit/?id=8ce3e9a76dd34be067486c014b9a9a1fc52854bc is the fix.</thetext>
  </long_desc><long_desc isprivate="0" >
    <commentid>91499</commentid>
    <comment_count>6</comment_count>
    <who name="Richard Purdie">richard.purdie</who>
    <bug_when>2021-09-22 17:31:25 +0000</bug_when>
    <thetext>These issues have been resolved now. I was seeing local failures but tracked that to an unrelated issue which I will sent a patch for separately.</thetext>
  </long_desc>
      
          <attachment
              isobsolete="0"
              ispatch="0"
              isprivate="0"
          >
            <attachid>4095</attachid>
            <date>2017-10-24 16:55:29 +0000</date>
            <delta_ts>2017-10-24 16:55:29 +0000</delta_ts>
            <desc>full_log</desc>
            <filename>nightly-x86_core_imagen_minimal.bb:do_testsdkext</filename>
            <type>application/octet-stream</type>
            <size>5193</size>
            <attacher name="oscar lopez arandas">oscarx.lopez.arandas</attacher>
            
              <data encoding="base64">CkJ1aWxkIENvbmZpZ3VyYXRpb246CkJCX1ZFUlNJT04gICAgICAgID0gIjEuMzIuMCIKQlVJTERf
U1lTICAgICAgICAgPSAieDg2XzY0LWxpbnV4IgpOQVRJVkVMU0JTVFJJTkcgICA9ICJ1bml2ZXJz
YWwiClRBUkdFVF9TWVMgICAgICAgID0gImk1ODYtcG9reS1saW51eCIKTUFDSElORSAgICAgICAg
ICAgPSAicWVtdXg4NiIKRElTVFJPICAgICAgICAgICAgPSAicG9reSIKRElTVFJPX1ZFUlNJT04g
ICAgPSAiMi4yLjIiClRVTkVfRkVBVFVSRVMgICAgID0gIm0zMiBpNTg2IgpUQVJHRVRfRlBVICAg
ICAgICA9ICIiCm1ldGEgICAgICAgICAgICAgIAptZXRhLXBva3kgICAgICAgICAKbWV0YS15b2N0
by1ic3AgICAgPSAiaGVhZHMvbW9ydHk6MWQ5MmNiMWEyMDEzNWNmZmZmZjlmOTRhNjYzM2VjMDg0
MDUxODczOCIKCkluaXRpYWxpc2luZyB0YXNrcy4uLk5PVEU6IE1hcmtpbmcgQWN0aXZlIFRhc2tz
Ck5PVEU6IFBydW5lZCAxODc2OSBpbmFjdGl2ZSB0YXNrcywgMiBsZWZ0Ck5PVEU6IEFzc2lnbiBX
ZWlnaHRpbmdzCk5PVEU6IENvbXB1dGUgdG90YWxzIChoYXZlIDIgZW5kcG9pbnQocykpCmRvbmUu
Ck5PVEU6IEV4ZWN1dGluZyBSdW5RdWV1ZSBUYXNrcwpOT1RFOiBSdW5uaW5nIHRhc2sgMSBvZiAy
ICgvaG9tZS9hYi9hdXRvYnVpbGRlci95b2N0by13b3JrZXIvbmlnaHRseS14ODYvYnVpbGQvbWV0
YS9yZWNpcGVzLXNhdG8vaW1hZ2VzL2NvcmUtaW1hZ2Utc2F0by5iYjpkb190ZXN0c2RrZXh0KQpO
T1RFOiBSdW5uaW5nIHRhc2sgMiBvZiAyICgvaG9tZS9hYi9hdXRvYnVpbGRlci95b2N0by13b3Jr
ZXIvbmlnaHRseS14ODYvYnVpbGQvbWV0YS9yZWNpcGVzLWNvcmUvaW1hZ2VzL2NvcmUtaW1hZ2Ut
bWluaW1hbC5iYjpkb190ZXN0c2RrZXh0KQpOT1RFOiByZWNpcGUgY29yZS1pbWFnZS1taW5pbWFs
LTEuMC1yMDogdGFzayBkb190ZXN0c2RrZXh0OiBTdGFydGVkCk5PVEU6IHJlY2lwZSBjb3JlLWlt
YWdlLXNhdG8tMS4wLXIwOiB0YXNrIGRvX3Rlc3RzZGtleHQ6IFN0YXJ0ZWQKRVJST1I6IGNvcmUt
aW1hZ2UtbWluaW1hbC0xLjAtcjAgZG9fdGVzdHNka2V4dDogQ291bGRuJ3QgaW5zdGFsbCB0aGUg
ZXh0ZW5zaWJsZSBTREs6ClBva3kgKFlvY3RvIFByb2plY3QgUmVmZXJlbmNlIERpc3RybykgRXh0
ZW5zaWJsZSBTREsgaW5zdGFsbGVyIHZlcnNpb24gMi4yLjIKPT09PT09PT09PT09PT09PT09PT09
PT09PT09PT09PT09PT09PT09PT09PT09PT09PT09PT09PT09PT09PT09PT09PT09PT09PT09PQpF
UlJPUjogY29yZS1pbWFnZS1zYXRvLTEuMC1yMCBkb19yb290ZnM6IENvdWxkIG5vdCBpbnZva2Ug
c21hcnQuIENvbW1hbmQgJy9ob21lL2FiL2F1dG9idWlsZGVyL3lvY3RvLXdvcmtlci9uaWdodGx5
LXg4Ni9idWlsZC9idWlsZC90bXAvd29yay9xZW11eDg2LXBva3ktbGludXgvY29yZS1pbWFnZS1z
YXRvLzEuMC1yMC90ZXN0c2RrZXh0L3RjL3RtcC9zeXNyb290cy94ODZfNjQtbGludXgvdXNyL2Jp
bi9zbWFydCAtLWxvZy1sZXZlbD13YXJuaW5nIC0tZGF0YS1kaXI9L2hvbWUvYWIvYXV0b2J1aWxk
ZXIveW9jdG8td29ya2VyL25pZ2h0bHkteDg2L2J1aWxkL2J1aWxkL3RtcC93b3JrL3FlbXV4ODYt
cG9reS1saW51eC9jb3JlLWltYWdlLXNhdG8vMS4wLXIwL3Rlc3RzZGtleHQvdGMvdG1wL3dvcmsv
cWVtdXg4Ni1wb2t5LWxpbnV4L2NvcmUtaW1hZ2Utc2F0by8xLjAtcjAvcm9vdGZzL3Zhci9saWIv
c21hcnQgY29uZmlnIC0tc2V0IHJwbS1yb290PS9ob21lL2FiL2F1dG9idWlsZGVyL3lvY3RvLXdv
cmtlci9uaWdodGx5LXg4Ni9idWlsZC9idWlsZC90bXAvd29yay9xZW11eDg2LXBva3ktbGludXgv
Y29yZS1pbWFnZS1zYXRvLzEuMC1yMC90ZXN0c2RrZXh0L3RjL3RtcC93b3JrL3FlbXV4ODYtcG9r
eS1saW51eC9jb3JlLWltYWdlLXNhdG8vMS4wLXIwL3Jvb3RmcycgcmV0dXJuZWQgMToKbmF0aXZl
cHl0aG9uOiAvaG9tZS9hYi9hdXRvYnVpbGRlci95b2N0by13b3JrZXIvbmlnaHRseS14ODYvYnVp
bGQvYnVpbGQvdG1wL3dvcmsvcWVtdXg4Ni1wb2t5LWxpbnV4L2NvcmUtaW1hZ2Utc2F0by8xLjAt
cjAvdGVzdHNka2V4dC90Yy90bXAvc3lzcm9vdHMtdW5pbmF0aXZlL3g4Nl82NC1saW51eC9saWIv
bGliYy5zby42OiB2ZXJzaW9uIGBHTElCQ18yLjI1JyBub3QgZm91bmQgKHJlcXVpcmVkIGJ5IC9o
b21lL2FiL2F1dG9idWlsZGVyL3lvY3RvLXdvcmtlci9uaWdodGx5LXg4Ni9idWlsZC9idWlsZC90
bXAvd29yay9xZW11eDg2LXBva3ktbGludXgvY29yZS1pbWFnZS1zYXRvLzEuMC1yMC90ZXN0c2Rr
ZXh0L3RjL3RtcC9zeXNyb290cy94ODZfNjQtbGludXgvdXNyL2Jpbi9weXRob24tbmF0aXZlLy4u
Ly4uL2xpYi9saWJweXRob24yLjcuc28uMS4wKQoKRVJST1I6IGNvcmUtaW1hZ2Utc2F0by0xLjAt
cjAgZG9fcm9vdGZzOiBGdW5jdGlvbiBmYWlsZWQ6IGRvX3Jvb3RmcwpFUlJPUjogTG9nZmlsZSBv
ZiBmYWlsdXJlIHN0b3JlZCBpbjogL2hvbWUvYWIvYXV0b2J1aWxkZXIveW9jdG8td29ya2VyL25p
Z2h0bHkteDg2L2J1aWxkL2J1aWxkL3RtcC93b3JrL3FlbXV4ODYtcG9reS1saW51eC9jb3JlLWlt
YWdlLXNhdG8vMS4wLXIwL3Rlc3RzZGtleHQvdGMvdG1wL3dvcmsvcWVtdXg4Ni1wb2t5LWxpbnV4
L2NvcmUtaW1hZ2Utc2F0by8xLjAtcjAvdGVtcC9sb2cuZG9fcm9vdGZzLjExMzkyCk5PVEU6IHJl
Y2lwZSBjb3JlLWltYWdlLXNhdG8tMS4wLXIwOiB0YXNrIGRvX3Jvb3RmczogRmFpbGVkCkVSUk9S
OiBUYXNrICgvaG9tZS9hYi9hdXRvYnVpbGRlci95b2N0by13b3JrZXIvbmlnaHRseS14ODYvYnVp
bGQvYnVpbGQvdG1wL3dvcmsvcWVtdXg4Ni1wb2t5LWxpbnV4L2NvcmUtaW1hZ2Utc2F0by8xLjAt
cjAvdGVzdHNka2V4dC90Yy9sYXllcnMvYnVpbGQvbWV0YS9yZWNpcGVzLXNhdG8vaW1hZ2VzL2Nv
cmUtaW1hZ2Utc2F0by5iYjpkb19yb290ZnMpIGZhaWxlZCB3aXRoIGV4aXQgY29kZSAnMScKTk9U
RTogVGFza3MgU3VtbWFyeTogQXR0ZW1wdGVkIDYxNzYgdGFza3Mgb2Ygd2hpY2ggNTcwNyBkaWRu
J3QgbmVlZCB0byBiZSByZXJ1biBhbmQgMSBmYWlsZWQuCk5PVEU6IFRoZSBlcnJvcnMgZm9yIHRo
aXMgYnVpbGQgYXJlIHN0b3JlZCBpbiAvaG9tZS9hYi9hdXRvYnVpbGRlci95b2N0by13b3JrZXIv
bmlnaHRseS14ODYvYnVpbGQvYnVpbGQvdG1wL3dvcmsvcWVtdXg4Ni1wb2t5LWxpbnV4L2NvcmUt
aW1hZ2Utc2F0by8xLjAtcjAvdGVzdHNka2V4dC90Yy90bXAvbG9nL2Vycm9yLXJlcG9ydC9lcnJv
cl9yZXBvcnRfMjAxNzEwMjQwODA0MDYudHh0CllvdSBjYW4gc2VuZCB0aGUgZXJyb3JzIHRvIGEg
cmVwb3J0cyBzZXJ2ZXIgYnkgcnVubmluZzoKICBzZW5kLWVycm9yLXJlcG9ydCAvaG9tZS9hYi9h
dXRvYnVpbGRlci95b2N0by13b3JrZXIvbmlnaHRseS14ODYvYnVpbGQvYnVpbGQvdG1wL3dvcmsv
cWVtdXg4Ni1wb2t5LWxpbnV4L2NvcmUtaW1hZ2Utc2F0by8xLjAtcjAvdGVzdHNka2V4dC90Yy90
bXAvbG9nL2Vycm9yLXJlcG9ydC9lcnJvcl9yZXBvcnRfMjAxNzEwMjQwODA0MDYudHh0IFstcyBz
ZXJ2ZXJdCk5PVEU6IFRoZSBjb250ZW50cyBvZiB0aGVzZSBsb2dzIHdpbGwgYmUgcG9zdGVkIGlu
IHB1YmxpYyBpZiB5b3UgdXNlIHRoZSBhYm92ZSBjb21tYW5kIHdpdGggdGhlIGRlZmF1bHQgc2Vy
dmVyLiBQbGVhc2UgZW5zdXJlIHlvdSByZW1vdmUgYW55IGlkZW50aWZ5aW5nIG9yIHByb3ByaWV0
YXJ5IGluZm9ybWF0aW9uIHdoZW4gcHJvbXB0ZWQgYmVmb3JlIHNlbmRpbmcuCgpFUlJPUjogY29y
ZS1pbWFnZS1zYXRvLTEuMC1yMCBkb190ZXN0c2RrZXh0OiBGdW5jdGlvbiBmYWlsZWQ6IGRvX3Rl
c3RzZGtleHQKRVJST1I6IExvZ2ZpbGUgb2YgZmFpbHVyZSBzdG9yZWQgaW46IC9ob21lL2FiL2F1
dG9idWlsZGVyL3lvY3RvLXdvcmtlci9uaWdodGx5LXg4Ni9idWlsZC9idWlsZC90bXAvd29yay9x
ZW11eDg2LXBva3ktbGludXgvY29yZS1pbWFnZS1zYXRvLzEuMC1yMC90ZW1wL2xvZy5kb190ZXN0
c2RrZXh0LjIyNDIyCkVSUk9SOiBUYXNrICgvaG9tZS9hYi9hdXRvYnVpbGRlci95b2N0by13b3Jr
ZXIvbmlnaHRseS14ODYvYnVpbGQvbWV0YS9yZWNpcGVzLXNhdG8vaW1hZ2VzL2NvcmUtaW1hZ2Ut
c2F0by5iYjpkb190ZXN0c2RrZXh0KSBmYWlsZWQgd2l0aCBleGl0IGNvZGUgJzEnCk5PVEU6IFRh
c2tzIFN1bW1hcnk6IEF0dGVtcHRlZCAyIHRhc2tzIG9mIHdoaWNoIDAgZGlkbid0IG5lZWQgdG8g
YmUgcmVydW4gYW5kIDIgZmFpbGVkLgpOT1RFOiBUaGUgZXJyb3JzIGZvciB0aGlzIGJ1aWxkIGFy
ZSBzdG9yZWQgaW4gL2hvbWUvYWIvYXV0b2J1aWxkZXIveW9jdG8td29ya2VyL25pZ2h0bHkteDg2
L2J1aWxkL2J1aWxkL3RtcC9sb2cvZXJyb3ItcmVwb3J0L2Vycm9yX3JlcG9ydF8yMDE3MTAyNDA3
NTg1OC50eHQKWW91IGNhbiBzZW5kIHRoZSBlcnJvcnMgdG8gYSByZXBvcnRzIHNlcnZlciBieSBy
dW5uaW5nOgogIHNlbmQtZXJyb3ItcmVwb3J0IC9ob21lL2FiL2F1dG9idWlsZGVyL3lvY3RvLXdv
cmtlci9uaWdodGx5LXg4Ni9idWlsZC9idWlsZC90bXAvbG9nL2Vycm9yLXJlcG9ydC9lcnJvcl9y
ZXBvcnRfMjAxNzEwMjQwNzU4NTgudHh0IFstcyBzZXJ2ZXJdCk5PVEU6IFRoZSBjb250ZW50cyBv
ZiB0aGVzZSBsb2dzIHdpbGwgYmUgcG9zdGVkIGluIHB1YmxpYyBpZiB5b3UgdXNlIHRoZSBhYm92
ZSBjb21tYW5kIHdpdGggdGhlIGRlZmF1bHQgc2VydmVyLiBQbGVhc2UgZW5zdXJlIHlvdSByZW1v
dmUgYW55IGlkZW50aWZ5aW5nIG9yIHByb3ByaWV0YXJ5IGluZm9ybWF0aW9uIHdoZW4gcHJvbXB0
ZWQgYmVmb3JlIHNlbmRpbmcuCgpTdW1tYXJ5OiAyIHRhc2tzIGZhaWxlZDoKICAvaG9tZS9hYi9h
dXRvYnVpbGRlci95b2N0by13b3JrZXIvbmlnaHRseS14ODYvYnVpbGQvbWV0YS9yZWNpcGVzLWNv
cmUvaW1hZ2VzL2NvcmUtaW1hZ2UtbWluaW1hbC5iYjpkb190ZXN0c2RrZXh0CiAgL2hvbWUvYWIv
YXV0b2J1aWxkZXIveW9jdG8td29ya2VyL25pZ2h0bHkteDg2L2J1aWxkL21ldGEvcmVjaXBlcy1z
YXRvL2ltYWdlcy9jb3JlLWltYWdlLXNhdG8uYmI6ZG9fdGVzdHNka2V4dApTdW1tYXJ5OiBUaGVy
ZSB3ZXJlIDQgRVJST1IgbWVzc2FnZXMgc2hvd24sIHJldHVybmluZyBhIG5vbi16ZXJvIGV4aXQg
Y29kZS4KcHJvZ3JhbSBmaW5pc2hlZCB3aXRoIGV4aXQgY29kZSAxCmVsYXBzZWRUaW1lPTQ4Ni40
MjA0MTQK
</data>

          </attachment>
      

    </bug>

</bugzilla>