<?xml version="1.0" encoding="UTF-8" standalone="yes" ?>
<!DOCTYPE bugzilla SYSTEM "https://bugzilla.yoctoproject.org/page.cgi?id=bugzilla.dtd">

<bugzilla version="5.0.6"
          urlbase="https://bugzilla.yoctoproject.org/"
          
          maintainer="it-coreprojects-helpdesk@linuxfoundation.org"
>

    <bug>
          <bug_id>12011</bug_id>
          
          <creation_ts>2017-08-30 16:58:22 +0000</creation_ts>
          <short_desc>do_testimage: FAIL: test_smart_channel_add</short_desc>
          <delta_ts>2018-01-11 16:10:33 +0000</delta_ts>
          <reporter_accessible>1</reporter_accessible>
          <cclist_accessible>1</cclist_accessible>
          <classification_id>10</classification_id>
          <classification>QA/Testing</classification>
          <product>Build Testing</product>
          <component>general</component>
          <version>2.2.2</version>
          <rep_platform>x86</rep_platform>
          <op_sys>Multiple</op_sys>
          <bug_status>RESOLVED</bug_status>
          <resolution>WONTFIX</resolution>
          
          
          <bug_file_loc></bug_file_loc>
          <status_whiteboard></status_whiteboard>
          <keywords></keywords>
          <priority>Medium</priority>
          <bug_severity>normal</bug_severity>
          <target_milestone>2.2.3</target_milestone>
          
          
          <everconfirmed>1</everconfirmed>
          <reporter name="Todor Minchev">todor.minchev</reporter>
          <assigned_to name="Armin Kuster">akuster</assigned_to>
          <cc>richard.purdie</cc>
          
          
          <cf_os>---</cf_os>
          <cf_regression_type>---</cf_regression_type>
          
          <cf_docchange>No (bug/feature does not impact docs)</cf_docchange>

      

      

      

          <comment_sort_order>oldest_to_newest</comment_sort_order>  
          <long_desc isprivate="0" >
    <commentid>76353</commentid>
    <comment_count>0</comment_count>
    <who name="Todor Minchev">todor.minchev</who>
    <bug_when>2017-08-30 16:58:22 +0000</bug_when>
    <thetext>https://autobuilder.yoctoproject.org/main/builders/nightly-ppc-lsb/builds/1184/steps/Running%20Sanity%20Tests/logs/stdio

File &quot;/home/pokybuild/yocto-autobuilder/yocto-worker/nightly-ppc-lsb/build/meta/lib/oeqa/runtime/smart.py&quot;, line 24, in smart
    self.assertEqual(status, expected, message)
AssertionError: 1 != 0 : smart update</thetext>
  </long_desc><long_desc isprivate="0" >
    <commentid>77587</commentid>
    <comment_count>1</comment_count>
    <who name="Armin Kuster">akuster</who>
    <bug_when>2017-10-14 01:52:03 +0000</bug_when>
    <thetext>ppc-lsb which should be the LTSI kernel (4.9)

nightly 590 - ross/rocko d9f4b79ec76b4e798b381c9546a93b8219638ab0

https://autobuilder.yocto.io/builders/nightly-ppc-lsb/builds/525/steps/Running%20Sanity%20Tests/logs/stdio


NOTE: recipe core-image-lsb-1.0-r0: task do_testimage: Succeeded
NOTE: core-image-lsb-sdk-1.0-r0 do_testimage: Target didn&apos;t reached login boot in 1500 seconds
NOTE: core-image-lsb-sdk-1.0-r0 do_testimage: Last 25 lines of text:
starting 8 nfsd kernel threads: [   27.773471] NFSD: Using /var/lib/nfs/v4recovery as the NFSv4 state recovery directory
[   27.774542] NFSD: starting 90-second grace period (net c0ac4728)
done

starting mountd: done

Starting system log daemon...0

Starting kernel log daemon...0

Starting internet superserver: xinetd.

 * Starting Avahi mDNS/DNS-SD Daemon: avahi-daemon

Starting Telephony daemon

Starting random number generator daemon.

No makedumpfile found.

Starting Lighttpd Web Server: lighttpd.

Starting crond: OK

Starting tcf-agent: OK
NOTE: core-image-lsb-sdk-1.0-r0 do_testimage: Check full boot log: /home/pokybuild/yocto-autobuilder/yocto-worker/nightly-ppc-lsb/build/build/tmp/work/qemuppc-poky-linux/core-image-lsb-sdk/1.0-r0/testimage/qemu_boot_log.20171013143811
WARNING: core-image-lsb-sdk-1.0-r0 do_testimage: Qemu ended unexpectedly, dump data from host is in /tmp/oe-saved-tests/201710131503_qemu
NOTE: core-image-lsb-sdk-1.0-r0 do_testimage: Stopping logging thread
NOTE: core-image-lsb-sdk-1.0-r0 do_testimage: Stop event received
NOTE: core-image-lsb-sdk-1.0-r0 do_testimage: Tearing down logging thread
NOTE: core-image-lsb-sdk-1.0-r0 do_testimage: Sending SIGTERM to runqemu
ERROR: core-image-lsb-sdk-1.0-r0 do_testimage: testimage received SIGTERM, shutting down...
ERROR: core-image-lsb-sdk-1.0-r0 do_testimage: core-image-lsb-sdk - FAILED - tests were interrupted during execution
ERROR: core-image-lsb-sdk-1.0-r0 do_testimage: Function failed: do_testimage
ERROR: Logfile of failure stored in: /home/pokybuild/yocto-autobuilder/yocto-worker/nightly-ppc-lsb/build/build/tmp/work/qemuppc-poky-linux/core-image-lsb-sdk/1.0-r0/temp/log.do_testimage.49217
NOTE: recipe core-image-lsb-sdk-1.0-r0: task do_testimage: Failed
ERROR: Task (/home/pokybuild/yocto-autobuilder/yocto-worker/nightly-ppc-lsb/build/meta/recipes-extended/images/core-image-lsb-sdk.bb:do_testimage) failed with exit code &apos;1&apos;
NOTE: Tasks Summary: Attempted 564 tasks of which 562 didn&apos;t need to be rerun and 1 failed.</thetext>
  </long_desc><long_desc isprivate="0" >
    <commentid>77588</commentid>
    <comment_count>2</comment_count>
    <who name="Armin Kuster">akuster</who>
    <bug_when>2017-10-14 01:52:36 +0000</bug_when>
    <thetext>(In reply to comment #1)
&gt; ppc-lsb which should be the LTSI kernel (4.9)
&gt; 
&gt; nightly 590 - ross/rocko d9f4b79ec76b4e798b381c9546a93b8219638ab0
&gt; 
&gt; https://autobuilder.yocto.io/builders/nightly-ppc-lsb/builds/525/steps/
&gt; Running%20Sanity%20Tests/logs/stdio
&gt; 
&gt; 
&gt; NOTE: recipe core-image-lsb-1.0-r0: task do_testimage: Succeeded
&gt; NOTE: core-image-lsb-sdk-1.0-r0 do_testimage: Target didn&apos;t reached login
&gt; boot in 1500 seconds
&gt; NOTE: core-image-lsb-sdk-1.0-r0 do_testimage: Last 25 lines of text:
&gt; starting 8 nfsd kernel threads: [   27.773471] NFSD: Using
&gt; /var/lib/nfs/v4recovery as the NFSv4 state recovery directory
&gt; [   27.774542] NFSD: starting 90-second grace period (net c0ac4728)
&gt; done
&gt; 
&gt; starting mountd: done
&gt; 
&gt; Starting system log daemon...0
&gt; 
&gt; Starting kernel log daemon...0
&gt; 
&gt; Starting internet superserver: xinetd.
&gt; 
&gt;  * Starting Avahi mDNS/DNS-SD Daemon: avahi-daemon
&gt; 
&gt; Starting Telephony daemon
&gt; 
&gt; Starting random number generator daemon.
&gt; 
&gt; No makedumpfile found.
&gt; 
&gt; Starting Lighttpd Web Server: lighttpd.
&gt; 
&gt; Starting crond: OK
&gt; 
&gt; Starting tcf-agent: OK
&gt; NOTE: core-image-lsb-sdk-1.0-r0 do_testimage: Check full boot log:
&gt; /home/pokybuild/yocto-autobuilder/yocto-worker/nightly-ppc-lsb/build/build/
&gt; tmp/work/qemuppc-poky-linux/core-image-lsb-sdk/1.0-r0/testimage/
&gt; qemu_boot_log.20171013143811
&gt; WARNING: core-image-lsb-sdk-1.0-r0 do_testimage: Qemu ended unexpectedly,
&gt; dump data from host is in /tmp/oe-saved-tests/201710131503_qemu
&gt; NOTE: core-image-lsb-sdk-1.0-r0 do_testimage: Stopping logging thread
&gt; NOTE: core-image-lsb-sdk-1.0-r0 do_testimage: Stop event received
&gt; NOTE: core-image-lsb-sdk-1.0-r0 do_testimage: Tearing down logging thread
&gt; NOTE: core-image-lsb-sdk-1.0-r0 do_testimage: Sending SIGTERM to runqemu
&gt; ERROR: core-image-lsb-sdk-1.0-r0 do_testimage: testimage received SIGTERM,
&gt; shutting down...
&gt; ERROR: core-image-lsb-sdk-1.0-r0 do_testimage: core-image-lsb-sdk - FAILED -
&gt; tests were interrupted during execution
&gt; ERROR: core-image-lsb-sdk-1.0-r0 do_testimage: Function failed: do_testimage
&gt; ERROR: Logfile of failure stored in:
&gt; /home/pokybuild/yocto-autobuilder/yocto-worker/nightly-ppc-lsb/build/build/
&gt; tmp/work/qemuppc-poky-linux/core-image-lsb-sdk/1.0-r0/temp/log.do_testimage.
&gt; 49217
&gt; NOTE: recipe core-image-lsb-sdk-1.0-r0: task do_testimage: Failed
&gt; ERROR: Task
&gt; (/home/pokybuild/yocto-autobuilder/yocto-worker/nightly-ppc-lsb/build/meta/
&gt; recipes-extended/images/core-image-lsb-sdk.bb:do_testimage) failed with exit
&gt; code &apos;1&apos;
&gt; NOTE: Tasks Summary: Attempted 564 tasks of which 562 didn&apos;t need to be
&gt; rerun and 1 failed.

wrong bug #</thetext>
  </long_desc><long_desc isprivate="0" >
    <commentid>79032</commentid>
    <comment_count>3</comment_count>
    <who name="Armin Kuster">akuster</who>
    <bug_when>2018-01-11 15:56:56 +0000</bug_when>
    <thetext>have not seen this in latest build runs</thetext>
  </long_desc><long_desc isprivate="0" >
    <commentid>79041</commentid>
    <comment_count>4</comment_count>
    <who name="Richard Purdie">richard.purdie</who>
    <bug_when>2018-01-11 16:10:33 +0000</bug_when>
    <thetext>We&apos;ve switched away from smart so we&apos;re unlikely to spend time investigating this kind of issue any further.</thetext>
  </long_desc>
      
      

    </bug>

</bugzilla>