<?xml version="1.0" encoding="UTF-8" standalone="yes" ?>
<!DOCTYPE bugzilla SYSTEM "https://bugzilla.yoctoproject.org/page.cgi?id=bugzilla.dtd">

<bugzilla version="5.0.6"
          urlbase="https://bugzilla.yoctoproject.org/"
          
          maintainer="it-coreprojects-helpdesk@linuxfoundation.org"
>

    <bug>
          <bug_id>12069</bug_id>
          
          <creation_ts>2017-09-08 21:32:02 +0000</creation_ts>
          <short_desc>[morty] ppc lsb neard failed to build</short_desc>
          <delta_ts>2017-09-12 09:54:52 +0000</delta_ts>
          <reporter_accessible>1</reporter_accessible>
          <cclist_accessible>1</cclist_accessible>
          <classification_id>7</classification_id>
          <classification>Build System, Metadata &amp; Runtime</classification>
          <product>OE-Core</product>
          <component>core</component>
          <version>2.2.2</version>
          <rep_platform>x86</rep_platform>
          <op_sys>Multiple</op_sys>
          <bug_status>RESOLVED</bug_status>
          <resolution>FIXED</resolution>
          
          
          <bug_file_loc>https://autobuilder.yocto.io/builders/nightly-ppc-lsb/builds/467/steps/BuildImages/logs/stdio</bug_file_loc>
          <status_whiteboard></status_whiteboard>
          <keywords></keywords>
          <priority>Undecided</priority>
          <bug_severity>normal</bug_severity>
          <target_milestone>---</target_milestone>
          
          
          <everconfirmed>1</everconfirmed>
          <reporter name="Armin Kuster">akuster</reporter>
          <assigned_to name="Armin Kuster">akuster</assigned_to>
          <cc>meta.mr.watcher</cc>
    
    <cc>meta.watcher</cc>
    
    <cc>richard.purdie</cc>
          
          
          <cf_os>---</cf_os>
          <cf_regression_type>Regression (Used to work)</cf_regression_type>
          
          <cf_docchange>Don&apos;t know</cf_docchange>

      

      

      

          <comment_sort_order>oldest_to_newest</comment_sort_order>  
          <long_desc isprivate="0" >
    <commentid>76705</commentid>
    <comment_count>0</comment_count>
    <who name="Armin Kuster">akuster</who>
    <bug_when>2017-09-08 21:32:02 +0000</bug_when>
    <thetext>| /usr/bin/mkdir -p src/ &amp;&amp; sed -e &apos;s,@pkglibexecdir\@,/usr/libexec/nfc,g&apos; &lt; ../neard-0.16/src/neard.service.in &gt; src/neard.service
| powerpc-poky-linux-gcc  -m32 -mhard-float -mcpu=7400 -mno-spe --sysroot=/home/pokybuild/yocto-autobuilder/yocto-worker/nightly-ppc-lsb/build/build/tmp/sysroots/qemuppc -DHAVE_CONFIG_H -I. -I../neard-0.16  -I/home/pokybuild/yocto-autobuilder/yocto-worker/nightly-ppc-lsb/build/build/tmp/sysroots/qemuppc/usr/include/glib-2.0 -I/home/pokybuild/yocto-autobuilder/yocto-worker/nightly-ppc-lsb/build/build/tmp/sysroots/qemuppc/usr/lib/glib-2.0/include -I/home/pokybuild/yocto-autobuilder/yocto-worker/nightly-ppc-lsb/build/build/tmp/sysroots/qemuppc/usr/include/dbus-1.0 -I/home/pokybuild/yocto-autobuilder/yocto-worker/nightly-ppc-lsb/build/build/tmp/sysroots/qemuppc/usr/lib/dbus-1.0/include -I/home/pokybuild/yocto-autobuilder/yocto-worker/nightly-ppc-lsb/build/build/tmp/sysroots/qemuppc/usr/include/libnl3 -DNEAR_PLUGIN_BUILTIN -DPLUGINDIR=\&quot;&quot;/usr/lib/neard/plugins&quot;\&quot; -DCONFIGDIR=\&quot;&quot;/etc/neard\&quot;&quot; -I./include -I./src -I../neard-0.16/gdbus -I../neard-0.16/src   -I./include -I./src -I../neard-0.16/gdbus -O2 -pipe -g -feliminate-unused-debug-types -fdebug-prefix-map=/home/pokybuild/yocto-autobuilder/yocto-worker/nightly-ppc-lsb/build/build/tmp/work/ppc7400-poky-linux/neard/0.16-r0=/usr/src/debug/neard/0.16-r0 -fdebug-prefix-map=/home/pokybuild/yocto-autobuilder/yocto-worker/nightly-ppc-lsb/build/build/tmp/sysroots/x86_64-linux= -fdebug-prefix-map=/home/pokybuild/yocto-autobuilder/yocto-worker/nightly-ppc-lsb/build/build/tmp/sysroots/qemuppc=  -fstack-protector-strong -D_FORTIFY_SOURCE=2 -c -o tools/nciattach.o ../neard-0.16/tools/nciattach.c
| In file included from ../neard-0.16/tools/nciattach.c:47:0:
| ../neard-0.16/src/near.h:30:27: fatal error: near/nfc_copy.h: No such file or directory
|  #include &lt;near/nfc_copy.h&gt;
|                            ^
| compilation terminated.
| Makefile:1502: recipe for target &apos;tools/nciattach.o&apos; failed
| make[1]: *** [tools/nciattach.o] Error 1
| make[1]: *** Waiting for unfinished jobs....
| Makefile:892: recipe for target &apos;all&apos; failed
| make: *** [all] Error 2</thetext>
  </long_desc><long_desc isprivate="0" >
    <commentid>76706</commentid>
    <comment_count>1</comment_count>
    <who name="Armin Kuster">akuster</who>
    <bug_when>2017-09-08 21:32:50 +0000</bug_when>
    <thetext>possible fix

https://patchwork.openembedded.org/patch/138215/</thetext>
  </long_desc><long_desc isprivate="0" >
    <commentid>76753</commentid>
    <comment_count>2</comment_count>
    <who name="Richard Purdie">richard.purdie</who>
    <bug_when>2017-09-12 09:54:52 +0000</bug_when>
    <thetext>http://git.yoctoproject.org/cgit.cgi/poky/commit/?h=morty&amp;id=a94a0c6402240ed02f364c87a5405f138634e46e</thetext>
  </long_desc>
      
      

    </bug>

</bugzilla>