<?xml version="1.0" encoding="UTF-8" standalone="yes" ?>
<!DOCTYPE bugzilla SYSTEM "https://bugzilla.yoctoproject.org/page.cgi?id=bugzilla.dtd">

<bugzilla version="5.0.6"
          urlbase="https://bugzilla.yoctoproject.org/"
          
          maintainer="it-coreprojects-helpdesk@linuxfoundation.org"
>

    <bug>
          <bug_id>12225</bug_id>
          
          <creation_ts>2017-10-14 03:41:11 +0000</creation_ts>
          <short_desc>[ross/mut] LTP update failed on multiple builds</short_desc>
          <delta_ts>2017-10-16 20:35:19 +0000</delta_ts>
          <reporter_accessible>1</reporter_accessible>
          <cclist_accessible>1</cclist_accessible>
          <classification_id>7</classification_id>
          <classification>Build System, Metadata &amp; Runtime</classification>
          <product>OE-Core</product>
          <component>core</component>
          <version>2.4.1</version>
          <rep_platform>x86</rep_platform>
          <op_sys>Multiple</op_sys>
          <bug_status>RESOLVED</bug_status>
          <resolution>FIXED</resolution>
          
          
          <bug_file_loc></bug_file_loc>
          <status_whiteboard></status_whiteboard>
          <keywords></keywords>
          <priority>Undecided</priority>
          <bug_severity>normal</bug_severity>
          <target_milestone>---</target_milestone>
          
          
          <everconfirmed>1</everconfirmed>
          <reporter name="Armin Kuster">akuster</reporter>
          <assigned_to name="Ross Burton">ross.burton</assigned_to>
          <cc>meta.mr.watcher</cc>
    
    <cc>meta.watcher</cc>
          
          
          <cf_os>---</cf_os>
          <cf_regression_type>---</cf_regression_type>
          
          <cf_docchange>Don&apos;t know</cf_docchange>

      

      

      

          <comment_sort_order>oldest_to_newest</comment_sort_order>  
          <long_desc isprivate="0" >
    <commentid>77592</commentid>
    <comment_count>0</comment_count>
    <who name="Armin Kuster">akuster</who>
    <bug_when>2017-10-14 03:41:11 +0000</bug_when>
    <thetext>nightly 591 - ross/mut 87d27c3d95640ba4ec4a0db138a3f2f0ddd481dc



| fcntl14.c: In function &apos;catch_alarm&apos;:
| fcntl14.c:904:22: warning: unused parameter &apos;sig&apos; [-Wunused-parameter]
| void catch_alarm(int sig)
| ^~~
| fcntl14.c: In function &apos;catch1&apos;:
| fcntl14.c:919:17: warning: unused parameter &apos;sig&apos; [-Wunused-parameter]
| void catch1(int sig)
| ^~~
| i586-poky-linux-gcc -m32 -march=i586 -Wl,-O1 -Wl,--hash-style=gnu -Wl,--as-needed -fstack-protector-strong -Wl,-z,relro,-z,now -fstack-protector-strong -D_FORTIFY_SOURCE=2 -Wformat -Wformat-security -Werror=format-security --sysroot=/home/pokybuild/yocto-autobuilder/yocto-worker/nightly-world-lsb/build/build/tmp/work/i586-poky-linux/ltp/20170929-r0/recipe-sysroot -O2 -pipe -g -feliminate-unused-debug-types -fdebug-prefix-map=/home/pokybuild/yocto-autobuilder/yocto-worker/nightly-world-lsb/build/build/tmp/work/i586-poky-linux/ltp/20170929-r0=/usr/src/debug/ltp/20170929-r0 -fdebug-prefix-map=/home/pokybuild/yocto-autobuilder/yocto- worker/n ightly-world-lsb/build/build/tmp/work/i586-poky-linux/ltp/20170929-r0/recipe-sysroot-native= -fdebug-prefix-map=/home/pokybuild/yocto-autobuilder/yocto-worker/nightly-world-lsb/build/build/tmp/work/i586-poky-linux/ltp/20170929-r0/recipe-sysroot= -g -O2 -fno-strict-aliasing -pipe -Wall -W -Wold-style-definition -I/home/pokybuild/yocto-autobuilder/yocto-worker/nightly-world-lsb/build/build/tmp/work/i586-poky-linux/ltp/20170929-r0/git/testcases/kernel/syscalls/fcntl -I/home/pokybuild/yocto-autobuilder/yocto-worker/nightly-world-lsb/build/build/tmp/work/i586-poky-linux/ltp/20170929-r0/git/testcases/kernel/syscalls/fcntl/../utils -D_GNU_SOURCE -I../../../../include -I../../../../include -I../../../../include/old/ -Wl,-O1 -Wl,--hash-style=gnu -Wl,--as-needed -fstack-protector-strong -Wl,-z,relro,-z,now -L../../../../lib fcntl26.c -lltp -o fcntl26
| i586-poky-linux-gcc -m32 -march=i586 -Wl,-O1 -Wl,--hash-style=gnu -Wl,--as-needed -fstack-protector-strong -Wl,-z,relro,-z,n ow -fsta ck-protector-strong -D_FORTIFY_SOURCE=2 -Wformat -Wformat-security -Werror=format-security --sysroot=/home/pokybuild/yocto-autobuilder/yocto-worker/nightly-world-lsb/build/build/tmp/work/i586-poky-linux/ltp/20170929-r0/recipe-sysroot -O2 -pipe -g -feliminate-unused-debug-types -fdebug-prefix-map=/home/pokybuild/yocto-autobuilder/yocto-worker/nightly-world-lsb/build/build/tmp/work/i586-poky-linux/ltp/20170929-r0=/usr/src/debug/ltp/20170929-r0 -fdebug-prefix-map=/home/pokybuild/yocto-autobuilder/yocto-worker/nightly-world-lsb/build/build/tmp/work/i586-poky-linux/ltp/20170929-r0/recipe-sysroot-native= -fdebug-prefix-map=/home/pokybuild/yocto-autobuilder/yocto-worker/nightly-world-lsb/build/build/tmp/work/i586-poky-linux/ltp/20170929-r0/recipe-sysroot= -g -O2 -fno-strict-aliasing -pipe -Wall -W -Wold-style-definition -I/home/pokybuild/yocto-autobuilder/yocto-worker/nightly-world-lsb/build/build/tmp/work/i586-poky-linux/ltp/20170929-r0/git/testcases/kernel/syscalls/fcntl -I/ho me/pokyb uild/yocto-autobuilder/yocto-worker/nightly-world-lsb/build/build/tmp/work/i586-poky-linux/ltp/20170929-r0/git/testcases/kernel/syscalls/fcntl/../utils -D_GNU_SOURCE -I../../../../include -I../../../../include -I../../../../include/old/ -Wl,-O1 -Wl,--hash-style=gnu -Wl,--as-needed -fstack-protector-strong -Wl,-z,relro,-z,now -L../../../../lib fcntl35.c -lltp -o fcntl35
| fcntl01.c: In function &apos;main&apos;:
| fcntl01.c:157:17: warning: comparison between signed and unsigned integer expressions [-Wsign-compare]
| for (i = 0; i &lt; ARRAY_SIZE(fd); i++)
| ^
| i586-poky-linux-gcc -m32 -march=i586 -Wl,-O1 -Wl,--hash-style=gnu -Wl,--as-needed -fstack-protector-strong -Wl,-z,relro,-z,now -fstack-protector-strong -D_FORTIFY_SOURCE=2 -Wformat -Wformat-security -Werror=format-security --sysroot=/home/pokybuild/yocto-autobuilder/yocto-worker/nightly-world-lsb/build/build/tmp/work/i586-poky-linux/ltp/20170929-r0/recipe-sysroot -O2 -pipe -g -feliminate-un used-deb ug-types -fdebug-prefix-map=/home/pokybuild/yocto-autobuilder/yocto-worker/nightly-world-lsb/build/build/tmp/work/i586-poky-linux/ltp/20170929-r0=/usr/src/debug/ltp/20170929-r0 -fdebug-prefix-map=/home/pokybuild/yocto-autobuilder/yocto-worker/nightly-world-lsb/build/build/tmp/work/i586-poky-linux/ltp/20170929-r0/recipe-sysroot-native= -fdebug-prefix-map=/home/pokybuild/yocto-autobuilder/yocto-worker/nightly-world-lsb/build/build/tmp/work/i586-poky-linux/ltp/20170929-r0/recipe-sysroot= -g -O2 -fno-strict-aliasing -pipe -Wall -W -Wold-style-definition -I/home/pokybuild/yocto-autobuilder/yocto-worker/nightly-world-lsb/build/build/tmp/work/i586-poky-linux/ltp/20170929-r0/git/testcases/kernel/syscalls/fcntl -I/home/pokybuild/yocto-autobuilder/yocto-worker/nightly-world-lsb/build/build/tmp/work/i586-poky-linux/ltp/20170929-r0/git/testcases/kernel/syscalls/fcntl/../utils -D_GNU_SOURCE -I../../../../include -I../../../../include -I../../../../include/old/ -Wl,-O1 -Wl,--hash-style= gnu -Wl, --as-needed -fstack-protector-strong -Wl,-z,relro,-z,now -L../../../../lib fcntl06.c -lltp -o fcntl06
| i586-poky-linux-gcc -m32 -march=i586 -Wl,-O1 -Wl,--hash-style=gnu -Wl,--as-needed -fstack-protector-strong -Wl,-z,relro,-z,now -fstack-protector-strong -D_FORTIFY_SOURCE=2 -Wformat -Wformat-security -Werror=format-security --sysroot=/home/pokybuild/yocto-autobuilder/yocto-worker/nightly-world-lsb/build/build/tmp/work/i586-poky-linux/ltp/20170929-r0/recipe-sysroot -O2 -pipe -g -feliminate-unused-debug-types -fdebug-prefix-map=/home/pokybuild/yocto-autobuilder/yocto-worker/nightly-world-lsb/build/build/tmp/work/i586-poky-linux/ltp/20170929-r0=/usr/src/debug/ltp/20170929-r0 -fdebug-prefix-map=/home/pokybuild/yocto-autobuilder/yocto-worker/nightly-world-lsb/build/build/tmp/work/i586-poky-linux/ltp/20170929-r0/recipe-sysroot-native= -fdebug-prefix-map=/home/pokybuild/yocto-autobuilder/yocto-worker/nightly-world-lsb/build/build/tmp/work/i586-poky-linux/ltp/20170929-r0/r ecipe-sy sroot= -g -O2 -fno-strict-aliasing -pipe -Wall -W -Wold-style-definition -I/home/pokybuild/yocto-autobuilder/yocto-worker/nightly-world-lsb/build/build/tmp/work/i586-poky-linux/ltp/20170929-r0/git/testcases/kernel/syscalls/fcntl -I/home/pokybuild/yocto-autobuilder/yocto-worker/nightly-world-lsb/build/build/tmp/work/i586-poky-linux/ltp/20170929-r0/git/testcases/kernel/syscalls/fcntl/../utils -D_GNU_SOURCE -I../../../../include -I../../../../include -I../../../../include/old/ -Wl,-O1 -Wl,--hash-style=gnu -Wl,--as-needed -fstack-protector-strong -Wl,-z,relro,-z,now -L../../../../lib fcntl11.c -lltp -o fcntl11
| i586-poky-linux-gcc -m32 -march=i586 -Wl,-O1 -Wl,--hash-style=gnu -Wl,--as-needed -fstack-protector-strong -Wl,-z,relro,-z,now -fstack-protector-strong -D_FORTIFY_SOURCE=2 -Wformat -Wformat-security -Werror=format-security --sysroot=/home/pokybuild/yocto-autobuilder/yocto-worker/nightly-world-lsb/build/build/tmp/work/i586-poky-linux/ltp/20170929-r0/recipe-sysr oot -O2 -pipe -g -feliminate-unused-debug-types -fdebug-prefix-map=/home/pokybuild/yocto-autobuilder/yocto-worker/nightly-world-lsb/build/build/tmp/work/i586-poky-linux/ltp/20170929-r0=/usr/src/debug/ltp/20170929-r0 -fdebug-prefix-map=/home/pokybuild/yocto-autobuilder/yocto-worker/nightly-world-lsb/build/build/tmp/work/i586-poky-linux/ltp/20170929-r0/recipe-sysroot-native= -fdebug-prefix-map=/home/pokybuild/yocto-autobuilder/yocto-worker/nightly-world-lsb/build/build/tmp/work/i586-poky-linux/ltp/20170929-r0/recipe-sysroot= -g -O2 -fno-strict-aliasing -pipe -Wall -W -Wold-style-definition -I/home/pokybuild/yocto-autobuilder/yocto-worker/nightly-world-lsb/build/build/tmp/work/i586-poky-linux/ltp/20170929-r0/git/testcases/kernel/syscalls/fcntl -I/home/pokybuild/yocto-autobuilder/yocto-worker/nightly-world-lsb/build/build/tmp/work/i586-poky-linux/ltp/20170929-r0/git/testcases/kernel/syscalls/fcntl/../utils -D_GNU_SOURCE -I../../../../include -I../../../../include -I../../../../include /old/ -W l,-O1 -Wl,--hash-style=gnu -Wl,--as-needed -fstack-protector-strong -Wl,-z,relro,-z,now -L../../../../lib fcntl28.c -lltp -o fcntl28
| fcntl06.c: In function &apos;main&apos;:
| fcntl06.c:74:6: warning: variable &apos;fail&apos; set but not used [-Wunused-but-set-variable]
| int fail = 0;
| ^~~~
| i586-poky-linux-gcc -m32 -march=i586 -Wl,-O1 -Wl,--hash-style=gnu -Wl,--as-needed -fstack-protector-strong -Wl,-z,relro,-z,now -fstack-protector-strong -D_FORTIFY_SOURCE=2 -Wformat -Wformat-security -Werror=format-security --sysroot=/home/pokybuild/yocto-autobuilder/yocto-worker/nightly-world-lsb/build/build/tmp/work/i586-poky-linux/ltp/20170929-r0/recipe-sysroot -O2 -pipe -g -feliminate-unused-debug-types -fdebug-prefix-map=/home/pokybuild/yocto-autobuilder/yocto-worker/nightly-world-lsb/build/build/tmp/work/i586-poky-linux/ltp/20170929-r0=/usr/src/debug/ltp/20170929-r0 -fdebug-prefix-map=/home/pokybuild/yocto-autobuilder/yocto-worker/nightly-world-lsb/build/build/tmp/wor k/i586-p oky-linux/ltp/20170929-r0/recipe-sysroot-native= -fdebug-prefix-map=/home/pokybuild/yocto-autobuilder/yocto-worker/nightly-world-lsb/build/build/tmp/work/i586-poky-linux/ltp/20170929-r0/recipe-sysroot= -g -O2 -fno-strict-aliasing -pipe -Wall -W -Wold-style-definition -I/home/pokybuild/yocto-autobuilder/yocto-worker/nightly-world-lsb/build/build/tmp/work/i586-poky-linux/ltp/20170929-r0/git/testcases/kernel/syscalls/fcntl -I/home/pokybuild/yocto-autobuilder/yocto-worker/nightly-world-lsb/build/build/tmp/work/i586-poky-linux/ltp/20170929-r0/git/testcases/kernel/syscalls/fcntl/../utils -D_GNU_SOURCE -I../../../../include -I../../../../include -I../../../../include/old/ -Wl,-O1 -Wl,--hash-style=gnu -Wl,--as-needed -fstack-protector-strong -Wl,-z,relro,-z,now -L../../../../lib fcntl15.c -lltp -o fcntl15
| cc1: some warnings being treated as errors
| /home/pokybuild/yocto-autobuilder/yocto-worker/nightly-world-lsb/build/build/tmp/work/i586-poky-linux/ltp/20170929-r0/git /testcas es/kernel/syscalls/fcntl/../utils/newer_64.mk:55: recipe for target &apos;fcntl36_64.o&apos; failed
| make[4]: *** [fcntl36_64.o] Error 1
| make[4]: *** Waiting for unfinished jobs....
| fcntl15.c: In function &apos;alarm_sig&apos;:
| fcntl15.c:81:20: warning: unused parameter &apos;sig&apos; [-Wunused-parameter]
| void alarm_sig(int sig)
| ^~~
| fcntl15.c: In function &apos;child_sig&apos;:
| fcntl15.c:92:20: warning: unused parameter &apos;sig&apos; [-Wunused-parameter]
| void child_sig(int sig)
| ^~~
| fcntl15.c: In function &apos;parent_sig&apos;:
| fcntl15.c:98:21: warning: unused parameter &apos;sig&apos; [-Wunused-parameter]
| void parent_sig(int sig)
| ^~~
| fcntl15.c: In function &apos;run_test&apos;:
| fcntl15.c:391:2: warning: ignoring return value of &apos;write&apos;, declared with attribute warn_unused_result [-Wunused-result]
| (void)write(fd_A, DATA, 10);
| ^~~~~~~~~~~~~~~~~~~~~~~~~~~
| rm fcntl05_64.o fcntl04_64.o fcntl22_6 4.o fcnt l27_64.o fcntl08_64.o fcntl19_64.o fcntl15_64.o fcntl18_64.o fcntl23_64.o fcntl09_64.o fcntl30_64.o fcntl35_64.o fcntl28_64.o fcntl14_64.o fcntl25_64.o fcntl32_64.o fcntl07_64.o fcntl34_64.o fcntl01_64.o fcntl24_64.o fcntl33_64.o fcntl10_64.o fcntl16_64.o fcntl02_64.o fcntl11_64.o fcntl17_64.o fcntl06_64.o fcntl31_64.o fcntl20_64.o fcntl29_64.o fcntl03_64.o fcntl12_64.o fcntl21_64.o fcntl26_64.o fcntl13_64.o
| make[4]: Leaving directory &apos;/home/pokybuild/yocto-autobuilder/yocto-worker/nightly-world-lsb/build/build/tmp/work/i586-poky-linux/ltp/20170929-r0/git/testcases/kernel/syscalls/fcntl&apos;
| ../../../include/mk/generic_trunk_target.inc:93: recipe for target &apos;all&apos; failed
| make[3]: *** [all] Error 2
| make[3]: Leaving directory &apos;/home/pokybuild/yocto-autobuilder/yocto-worker/nightly-world-lsb/build/build/tmp/work/i586-poky-linux/ltp/20170929-r0/git/testcases/kernel/syscalls&apos;
| ../../include/mk/generic_trunk_target.inc:93: recipe for target &apos;all&apos; failed
| mak e[2]: ** * [all] Error 2
| make[2]: Leaving directory &apos;/home/pokybuild/yocto-autobuilder/yocto-worker/nightly-world-lsb/build/build/tmp/work/i586-poky-linux/ltp/20170929-r0/git/testcases/kernel&apos;
| ../include/mk/generic_trunk_target.inc:93: recipe for target &apos;all&apos; failed
| make[1]: *** [all] Error 2
| make[1]: Leaving directory &apos;/home/pokybuild/yocto-autobuilder/yocto-worker/nightly-world-lsb/build/build/tmp/work/i586-poky-linux/ltp/20170929-r0/git/testcases&apos;
| Makefile:119: recipe for target &apos;testcases-all&apos; failed
| make: *** [testcases-all] Error 2
| ERROR: oe_runmake failed
| WARNING: exit code 1 from a shell command.
| ERROR: Function failed: do_compile (log file is located at /home/pokybuild/yocto-autobuilder/yocto-worker/nightly-world-lsb/build/build/tmp/work/i586-poky-linux/ltp/20170929-r0/temp/log.do_compile.30906)
ERROR: Task (/home/pokybuild/yocto-autobuilder/yocto-worker/nightly-world-lsb/build/meta/recipes-extended/ltp/ltp_20170929.bb:do_compi le) fail ed with exit code &apos;1&apos;
Summary: There were 9 ERROR messages shown, returning a non-zero exit code.</thetext>
  </long_desc><long_desc isprivate="0" >
    <commentid>77620</commentid>
    <comment_count>1</comment_count>
    <who name="Ross Burton">ross.burton</who>
    <bug_when>2017-10-16 20:35:19 +0000</bug_when>
    <thetext>MUT specific, patch rejected.</thetext>
  </long_desc>
      
      

    </bug>

</bugzilla>