<?xml version="1.0" encoding="UTF-8" standalone="yes" ?>
<!DOCTYPE bugzilla SYSTEM "https://bugzilla.yoctoproject.org/page.cgi?id=bugzilla.dtd">

<bugzilla version="5.0.6"
          urlbase="https://bugzilla.yoctoproject.org/"
          
          maintainer="it-coreprojects-helpdesk@linuxfoundation.org"
>

    <bug>
          <bug_id>12251</bug_id>
          
          <creation_ts>2017-10-19 03:23:56 +0000</creation_ts>
          <short_desc>[ross/mut] nightly-oe-selftest failed</short_desc>
          <delta_ts>2017-12-21 09:45:14 +0000</delta_ts>
          <reporter_accessible>1</reporter_accessible>
          <cclist_accessible>1</cclist_accessible>
          <classification_id>7</classification_id>
          <classification>Build System, Metadata &amp; Runtime</classification>
          <product>OE-Core</product>
          <component>core</component>
          <version>2.4.1</version>
          <rep_platform>x86</rep_platform>
          <op_sys>Multiple</op_sys>
          <bug_status>RESOLVED</bug_status>
          <resolution>FIXED</resolution>
          
          
          <bug_file_loc>https://autobuilder.yocto.io/builders/nightly-oe-selftest/builds/569/steps/Running oe-selftest/logs/stdio</bug_file_loc>
          <status_whiteboard></status_whiteboard>
          <keywords></keywords>
          <priority>Medium+</priority>
          <bug_severity>normal</bug_severity>
          <target_milestone>2.5 M1</target_milestone>
          
          
          <everconfirmed>1</everconfirmed>
          <reporter name="Armin Kuster">akuster</reporter>
          <assigned_to name="Ross Burton">ross.burton</assigned_to>
          <cc>meta.mr.watcher</cc>
    
    <cc>meta.watcher</cc>
          
          
          <cf_os>---</cf_os>
          <cf_regression_type>---</cf_regression_type>
          
          <cf_docchange>Don&apos;t know</cf_docchange>

      

      

      

          <comment_sort_order>oldest_to_newest</comment_sort_order>  
          <long_desc isprivate="0" >
    <commentid>77683</commentid>
    <comment_count>0</comment_count>
    <who name="Armin Kuster">akuster</who>
    <bug_when>2017-10-19 03:23:56 +0000</bug_when>
    <thetext>2017-10-17 21:20:07,934 - oe-selftest - INFO - Traceback (most recent call last):
  File &quot;/home/pokybuild/yocto-autobuilder/yocto-worker/nightly-oe-selftest/build/meta/lib/oeqa/selftest/cases/runtime_test.py&quot;, line 266, in test_postinst_rootfs_and_boot
    result = runCmd(&apos;ssh %s root@%s %s&apos; % (sshargs, qemu.ip, testcommand))
  File &quot;/home/pokybuild/yocto-autobuilder/yocto-worker/nightly-oe-selftest/build/meta/lib/oeqa/utils/commands.py&quot;, line 191, in runCmd
    raise AssertionError(&quot;Command &apos;%s&apos; returned non-zero exit status %d:\n%s&quot; % (command, result.status, exc_output))
AssertionError: Command &apos;ssh -o UserKnownHostsFile=/dev/null -o StrictHostKeyChecking=no root@192.168.7.2 ls /etc/this-was-created-at-first-boot&apos; returned non-zero exit status 255:
ssh: connect to host 192.168.7.2 port 22: Connection refused

Stdout:
Previous bitbake instance shutting down?, waiting to retry...</thetext>
  </long_desc><long_desc isprivate="0" >
    <commentid>77727</commentid>
    <comment_count>1</comment_count>
    <who name="Ross Burton">ross.burton</who>
    <bug_when>2017-10-20 10:14:23 +0000</bug_when>
    <thetext>*** Bug 12256 has been marked as a duplicate of this bug. ***</thetext>
  </long_desc><long_desc isprivate="0" >
    <commentid>77728</commentid>
    <comment_count>2</comment_count>
    <who name="Ross Burton">ross.burton</who>
    <bug_when>2017-10-20 10:14:54 +0000</bug_when>
    <thetext>The actual error is runqemu saying &quot;Couldn&apos;t login into serial console as root using blank password&quot;.  Suggests that debug-tweaks isn&apos;t enabled?</thetext>
  </long_desc><long_desc isprivate="0" >
    <commentid>77996</commentid>
    <comment_count>3</comment_count>
    <who name="Ross Burton">ross.burton</who>
    <bug_when>2017-11-06 17:38:30 +0000</bug_when>
    <thetext>Turns out I broke this test.  Working on it now.</thetext>
  </long_desc><long_desc isprivate="0" >
    <commentid>78781</commentid>
    <comment_count>4</comment_count>
    <who name="Ross Burton">ross.burton</who>
    <bug_when>2017-12-21 09:45:14 +0000</bug_when>
    <thetext>Fixed in 781a1be88f5812157a231bf5771a01bb978bfcd9.</thetext>
  </long_desc>
      
      

    </bug>

</bugzilla>