<?xml version="1.0" encoding="UTF-8" standalone="yes" ?>
<!DOCTYPE bugzilla SYSTEM "https://bugzilla.yoctoproject.org/page.cgi?id=bugzilla.dtd">

<bugzilla version="5.0.6"
          urlbase="https://bugzilla.yoctoproject.org/"
          
          maintainer="it-coreprojects-helpdesk@linuxfoundation.org"
>

    <bug>
          <bug_id>12935</bug_id>
          
          <creation_ts>2018-09-27 02:30:52 +0000</creation_ts>
          <short_desc>[master-next] nightly-musl-x86-64 FAIL: test_kernel_module</short_desc>
          <delta_ts>2018-09-27 14:45:26 +0000</delta_ts>
          <reporter_accessible>1</reporter_accessible>
          <cclist_accessible>1</cclist_accessible>
          <classification_id>7</classification_id>
          <classification>Build System, Metadata &amp; Runtime</classification>
          <product>OE-Core</product>
          <component>core</component>
          <version>2.6</version>
          <rep_platform>x86</rep_platform>
          <op_sys>Multiple</op_sys>
          <bug_status>RESOLVED</bug_status>
          <resolution>OBSOLETE</resolution>
          
          
          <bug_file_loc>https://autobuilder.yoctoproject.org/typhoon/#/builders/27/builds/77/steps/7/logs/step1c</bug_file_loc>
          <status_whiteboard></status_whiteboard>
          <keywords></keywords>
          <priority>Undecided</priority>
          <bug_severity>normal</bug_severity>
          <target_milestone>---</target_milestone>
          
          
          <everconfirmed>1</everconfirmed>
          <reporter name="Armin Kuster">akuster</reporter>
          <assigned_to name="Bruce Ashfield">bruce.ashfield</assigned_to>
          <cc>meta.mr.watcher</cc>
    
    <cc>meta.watcher</cc>
    
    <cc>richard.purdie</cc>
          
          
          <cf_os>---</cf_os>
          <cf_regression_type>---</cf_regression_type>
          
          <cf_docchange>Don&apos;t know</cf_docchange>

      

      

      

          <comment_sort_order>oldest_to_newest</comment_sort_order>  
          <long_desc isprivate="0" >
    <commentid>81644</commentid>
    <comment_count>0</comment_count>
    <who name="Armin Kuster">akuster</who>
    <bug_when>2018-09-27 02:30:52 +0000</bug_when>
    <thetext>| NOTE: ======================================================================
| NOTE: FAIL: test_kernel_module (kernelmodule.KernelModuleTest)
| NOTE: ----------------------------------------------------------------------
| NOTE: Traceback (most recent call last):
|   File &quot;/home/pokybuild/yocto-worker/nightly-musl-x86-64/build/meta/lib/oeqa/core/decorator/__init__.py&quot;, line 32, in wrapped_f
|     return func(*args, **kwargs)
|   File &quot;/home/pokybuild/yocto-worker/nightly-musl-x86-64/build/meta/lib/oeqa/core/decorator/__init__.py&quot;, line 32, in wrapped_f
|     return func(*args, **kwargs)
|   File &quot;/home/pokybuild/yocto-worker/nightly-musl-x86-64/build/meta/lib/oeqa/core/decorator/__init__.py&quot;, line 32, in wrapped_f
|     return func(*args, **kwargs)
|   File &quot;/home/pokybuild/yocto-worker/nightly-musl-x86-64/build/meta/lib/oeqa/runtime/cases/kernelmodule.py&quot;, line 40, in test_kernel_module
|     self.assertEqual(status, 0, msg=&apos;\n&apos;.join([cmd, output]))
| AssertionError: 2 != 0 : cd /usr/src/kernel &amp;&amp; make scripts prepare


&lt;snipped&gt;

|   HOSTLD  arch/x86/tools/relocs
|   DESCEND  objtool
| make[4]: *** No rule to make target &apos;/lib/modules/4.18.9-yocto-standard/build/tools/objtool/fixdep.o&apos;, needed by &apos;/lib/modules/4.18.9-yocto-standard/build/tools/objtool/fixdep-in.o&apos;.  Stop.
| make[3]: *** [Makefile:43: /lib/modules/4.18.9-yocto-standard/build/tools/objtool/fixdep-in.o] Error 2
| make[2]: *** [/lib/modules/4.18.9-yocto-standard/build/tools/build/Makefile.include:4: fixdep] Error 2
| make[1]: *** [Makefile:63: objtool] Error 2
| make: *** [Makefile:1631: tools/objtool] Error 2</thetext>
  </long_desc><long_desc isprivate="0" >
    <commentid>81650</commentid>
    <comment_count>1</comment_count>
    <who name="Bruce Ashfield">bruce.ashfield</who>
    <bug_when>2018-09-27 13:09:04 +0000</bug_when>
    <thetext>So this only triggers with master-next ? Did someone modify devsrc ? If so, I&apos;d recommend a revert versus a fix at this point.

I&apos;ll see if I can reproduce the problem here.</thetext>
  </long_desc><long_desc isprivate="0" >
    <commentid>81655</commentid>
    <comment_count>2</comment_count>
    <who name="Richard Purdie">richard.purdie</who>
    <bug_when>2018-09-27 14:45:26 +0000</bug_when>
    <thetext>This patch was being tested in -next and breaks things so was dropped.</thetext>
  </long_desc>
      
      

    </bug>

</bugzilla>