<?xml version="1.0" encoding="UTF-8" standalone="yes" ?>
<!DOCTYPE bugzilla SYSTEM "https://bugzilla.yoctoproject.org/page.cgi?id=bugzilla.dtd">

<bugzilla version="5.0.6"
          urlbase="https://bugzilla.yoctoproject.org/"
          
          maintainer="it-coreprojects-helpdesk@linuxfoundation.org"
>

    <bug>
          <bug_id>13062</bug_id>
          
          <creation_ts>2018-12-05 14:06:07 +0000</creation_ts>
          <short_desc>oe-selftest PR server failure</short_desc>
          <delta_ts>2020-04-23 08:00:39 +0000</delta_ts>
          <reporter_accessible>1</reporter_accessible>
          <cclist_accessible>1</cclist_accessible>
          <classification_id>10</classification_id>
          <classification>QA/Testing</classification>
          <product>Functional (self) Testing</product>
          <component>oe-selftest</component>
          <version>2.7</version>
          <rep_platform>x86</rep_platform>
          <op_sys>Multiple</op_sys>
          <bug_status>RESOLVED</bug_status>
          <resolution>WORKSFORME</resolution>
          
          
          <bug_file_loc></bug_file_loc>
          <status_whiteboard></status_whiteboard>
          <keywords></keywords>
          <priority>Medium+</priority>
          <bug_severity>normal</bug_severity>
          <target_milestone>3.2 M1</target_milestone>
          
          
          <everconfirmed>1</everconfirmed>
          <reporter name="Richard Purdie">richard.purdie</reporter>
          <assigned_to name="Unassigned">unassigned</assigned_to>
          <cc>JPEWhacker</cc>
    
    <cc>mhalstead</cc>
    
    <cc>Qi.Chen</cc>
    
    <cc>randy.macleod</cc>
          
          
          <cf_os>---</cf_os>
          <cf_regression_type>---</cf_regression_type>
          
          <cf_docchange>No (bug/feature does not impact docs)</cf_docchange>

      

      

      

          <comment_sort_order>oldest_to_newest</comment_sort_order>  
          <long_desc isprivate="0" >
    <commentid>82407</commentid>
    <comment_count>0</comment_count>
    <who name="Richard Purdie">richard.purdie</who>
    <bug_when>2018-12-05 14:06:07 +0000</bug_when>
    <thetext>https://autobuilder.yoctoproject.org/typhoon/#/builders/84/builds/54

018-12-04 20:35:34,572 - oe-selftest - INFO - ======================================================================
2018-12-04 20:35:34,583 - oe-selftest - INFO - FAIL: prservice.BitbakePrTests.test_import_export_override_db (subunit.RemotedTestCase)
2018-12-04 20:35:34,586 - oe-selftest - INFO - ----------------------------------------------------------------------
2018-12-04 20:35:34,586 - oe-selftest - INFO - testtools.testresult.real._StringException: Traceback (most recent call last):
  File &quot;/home/pokybuild/yocto-worker/oe-selftest-opensuse/build/meta/lib/oeqa/core/decorator/__init__.py&quot;, line 32, in wrapped_f
    return func(*args, **kwargs)
  File &quot;/home/pokybuild/yocto-worker/oe-selftest-opensuse/build/meta/lib/oeqa/selftest/cases/prservice.py&quot;, line 97, in test_import_export_override_db
    self.run_test_pr_export_import(&apos;m4&apos;, replace_current_db=False)
  File &quot;/home/pokybuild/yocto-worker/oe-selftest-opensuse/build/meta/lib/oeqa/selftest/cases/prservice.py&quot;, line 69, in run_test_pr_export_import
    self.increment_package_pr(package_name)
  File &quot;/home/pokybuild/yocto-worker/oe-selftest-opensuse/build/meta/lib/oeqa/selftest/cases/prservice.py&quot;, line 44, in increment_package_pr
    self.assertEqual(res.status, 0, msg=res.output)
  File &quot;/usr/lib64/python3.4/unittest/case.py&quot;, line 800, in assertEqual
    assertion_func(first, second, msg=msg)
  File &quot;/usr/lib64/python3.4/unittest/case.py&quot;, line 793, in _baseAssertEqual
    raise self.failureException(msg)
AssertionError: 1 != 0 : NOTE: Started PRServer with DBfile: /home/pokybuild/yocto-worker/oe-selftest-opensuse/build/build-st-28527/cache/prserv.sqlite3, IP: 127.0.0.1, PORT: 44631, PID: 19062
Parsing recipes...done.
Parsing of 816 .bb files complete (0 cached, 816 parsed). 1304 targets, 43 skipped, 0 masked, 0 errors.
NOTE: Resolving any missing task queue dependencies

Build Configuration:
[...]


NOTE: recipe m4-1.4.18-r0: task do_install: Succeeded
NOTE: Running task 452 of 457 (/home/pokybuild/yocto-worker/oe-selftest-opensuse/build/meta/recipes-devtools/m4/m4_1.4.18.bb:do_package)
NOTE: recipe m4-1.4.18-r0: task do_package: Started
ERROR: m4-1.4.18-r0 do_package: Can NOT get PRAUTO, exception timed out
ERROR: m4-1.4.18-r0 do_package: Function failed: package_get_auto_pr
ERROR: Logfile of failure stored in: /home/pokybuild/yocto-worker/oe-selftest-opensuse/build/build-st-28527/tmp/work/core2-64-poky-linux/m4/1.4.18-r0/temp/log.do_package.7733
NOTE: recipe m4-1.4.18-r0: task do_package: Failed
ERROR: Task (/home/pokybuild/yocto-worker/oe-selftest-opensuse/build/meta/recipes-devtools/m4/m4_1.4.18.bb:do_package) failed with exit code &apos;1&apos;
NOTE: Tasks Summary: Attempted 453 tasks of which 445 didn&apos;t need to be rerun and 1 failed.
NOTE: The errors for this build are stored in /home/pokybuild/yocto-worker/oe-selftest-opensuse/build/build-st-28527/tmp/log/error-report/error_report_20181204182301.txt
You can send the errors to a reports server by running:
  send-error-report /home/pokybuild/yocto-worker/oe-selftest-opensuse/build/build-st-28527/tmp/log/error-report/error_report_20181204182301.txt [-s server]
NOTE: The contents of these logs will be posted in public if you use the above command with the default server. Please ensure you remove any identifying or proprietary information when prompted before sending.

Summary: 1 task failed:
  /home/pokybuild/yocto-worker/oe-selftest-opensuse/build/meta/recipes-devtools/m4/m4_1.4.18.bb:do_package
Summary: There were 2 ERROR messages shown, returning a non-zero exit code.

======================================================================
2018-12-04 20:35:34,586 - oe-selftest - INFO - FAIL: prservice.BitbakePrTests.test_import_export_replace_db (subunit.RemotedTestCase)
2018-12-04 20:35:34,586 - oe-selftest - INFO - ----------------------------------------------------------------------
2018-12-04 20:35:34,586 - oe-selftest - INFO - testtools.testresult.real._StringException: Traceback (most recent call last):
  File &quot;/home/pokybuild/yocto-worker/oe-selftest-opensuse/build/meta/lib/oeqa/core/decorator/__init__.py&quot;, line 32, in wrapped_f
    return func(*args, **kwargs)
  File &quot;/home/pokybuild/yocto-worker/oe-selftest-opensuse/build/meta/lib/oeqa/selftest/cases/prservice.py&quot;, line 93, in test_import_export_replace_db
    self.run_test_pr_export_import(&apos;m4&apos;)
  File &quot;/home/pokybuild/yocto-worker/oe-selftest-opensuse/build/meta/lib/oeqa/selftest/cases/prservice.py&quot;, line 86, in run_test_pr_export_import
    self.increment_package_pr(package_name)
  File &quot;/home/pokybuild/yocto-worker/oe-selftest-opensuse/build/meta/lib/oeqa/selftest/cases/prservice.py&quot;, line 44, in increment_package_pr
    self.assertEqual(res.status, 0, msg=res.output)
  File &quot;/usr/lib64/python3.4/unittest/case.py&quot;, line 800, in assertEqual
    assertion_func(first, second, msg=msg)
  File &quot;/usr/lib64/python3.4/unittest/case.py&quot;, line 793, in _baseAssertEqual
    raise self.failureException(msg)
AssertionError: 1 != 0 : NOTE: Started PRServer with DBfile: /home/pokybuild/yocto-worker/oe-selftest-opensuse/build/build-st-28527/cache/prserv.sqlite3, IP: 127.0.0.1, PORT: 37507, PID: 5711
Parsing recipes...done.
Parsing of 816 .bb files complete (0 cached, 816 parsed). 1304 targets, 43 skipped, 0 masked, 0 errors.
NOTE: Resolving any missing task queue dependencies

Build Configuration:
BB_VERSION           = &quot;1.40.0&quot;
BUILD_SYS            = &quot;x86_64-linux&quot;
NATIVELSBSTRING      = &quot;universal-4.8&quot;
TARGET_SYS           = &quot;x86_64-poky-linux&quot;
MACHINE              = &quot;qemux86-64&quot;
DISTRO               = &quot;poky&quot;
DISTRO_VERSION       = &quot;2.6+snapshot-20181204&quot;
TUNE_FEATURES        = &quot;m64 core2&quot;
TARGET_FPU           = &quot;&quot;
meta                 
meta-poky            
meta-yocto-bsp       = &quot;master-next:38ae87bbf0ead1183ed801c0ed4f1878d6761bb9&quot;
meta-selftest        = &quot;master:2e6cefced1f0108034fd9b7a1a106502c69d05e5&quot;

Initialising tasks...done.
Sstate summary: Wanted 4 Found 0 Missed 4 Current 74 (0% match, 94% complete)
NOTE: Executing SetScene Tasks
NOTE: Executing RunQueue Tasks
NOTE: Running task 446 of 457 (/home/pokybuild/yocto-worker/oe-selftest-opensuse/build/meta/recipes-devtools/m4/m4_1.4.18.bb:do_package)
NOTE: recipe m4-1.4.18-r0: task do_package: Started
ERROR: m4-1.4.18-r0 do_package: Can NOT get PRAUTO, exception timed out
ERROR: m4-1.4.18-r0 do_package: Function failed: package_get_auto_pr
ERROR: Logfile of failure stored in: /home/pokybuild/yocto-worker/oe-selftest-opensuse/build/build-st-28527/tmp/work/core2-64-poky-linux/m4/1.4.18-r0/temp/log.do_package.7860
NOTE: recipe m4-1.4.18-r0: task do_package: Failed
ERROR: Task (/home/pokybuild/yocto-worker/oe-selftest-opensuse/build/meta/recipes-devtools/m4/m4_1.4.18.bb:do_package) failed with exit code &apos;1&apos;
NOTE: Tasks Summary: Attempted 453 tasks of which 452 didn&apos;t need to be rerun and 1 failed.
NOTE: The errors for this build are stored in /home/pokybuild/yocto-worker/oe-selftest-opensuse/build/build-st-28527/tmp/log/error-report/error_report_20181204192605.txt
You can send the errors to a reports server by running:
  send-error-report /home/pokybuild/yocto-worker/oe-selftest-opensuse/build/build-st-28527/tmp/log/error-report/error_report_20181204192605.txt [-s server]
NOTE: The contents of these logs will be posted in public if you use the above command with the default server. Please ensure you remove any identifying or proprietary information when prompted before sending.

Summary: 1 task failed:
  /home/pokybuild/yocto-worker/oe-selftest-opensuse/build/meta/recipes-devtools/m4/m4_1.4.18.bb:do_package
Summary: There were 2 ERROR messages shown, returning a non-zero exit code.

----------------------------------------------------------------------
2018-12-04 20:35:34,586 - oe-selftest - INFO - Ran 336 tests in 27171.420s
2018-12-04 20:35:34,587 - oe-selftest - INFO - FAILED
2018-12-04 20:35:34,587 - oe-selftest - INFO -  (failures=2, skipped=2)</thetext>
  </long_desc><long_desc isprivate="0" >
    <commentid>82408</commentid>
    <comment_count>1</comment_count>
    <who name="Richard Purdie">richard.purdie</who>
    <bug_when>2018-12-05 14:06:29 +0000</bug_when>
    <thetext>Key maybe ERROR: m4-1.4.18-r0 do_package: Can NOT get PRAUTO, exception timed out</thetext>
  </long_desc><long_desc isprivate="0" >
    <commentid>82421</commentid>
    <comment_count>2</comment_count>
    <who name="Richard Purdie">richard.purdie</who>
    <bug_when>2018-12-06 15:51:07 +0000</bug_when>
    <thetext>Joshua Watt has some patches to persist DB which improve connection problems and there may be lessons learnt there that are applicable to PR Serv.</thetext>
  </long_desc><long_desc isprivate="0" >
    <commentid>82463</commentid>
    <comment_count>3</comment_count>
    <who name="Chen Qi">Qi.Chen</who>
    <bug_when>2018-12-11 09:24:27 +0000</bug_when>
    <thetext>https://autobuilder.yoctoproject.org/typhoon/#/builders/45/builds/81/steps/7/logs/step1b</thetext>
  </long_desc><long_desc isprivate="0" >
    <commentid>87073</commentid>
    <comment_count>4</comment_count>
    <who name="Randy MacLeod">randy.macleod</who>
    <bug_when>2020-04-23 08:00:39 +0000</bug_when>
    <thetext>Currently working on the autobuider for about a year.</thetext>
  </long_desc>
      
      

    </bug>

</bugzilla>