<?xml version="1.0" encoding="UTF-8" standalone="yes" ?>
<!DOCTYPE bugzilla SYSTEM "https://bugzilla.yoctoproject.org/page.cgi?id=bugzilla.dtd">

<bugzilla version="5.0.6"
          urlbase="https://bugzilla.yoctoproject.org/"
          
          maintainer="it-coreprojects-helpdesk@linuxfoundation.org"
>

    <bug>
          <bug_id>13227</bug_id>
          
          <creation_ts>2019-03-18 02:34:17 +0000</creation_ts>
          <short_desc>ross/mut] python-2.7.15-r1 do_patch</short_desc>
          <delta_ts>2019-03-18 10:46:56 +0000</delta_ts>
          <reporter_accessible>1</reporter_accessible>
          <cclist_accessible>1</cclist_accessible>
          <classification_id>7</classification_id>
          <classification>Build System, Metadata &amp; Runtime</classification>
          <product>OE-Core</product>
          <component>core</component>
          <version>5.99</version>
          <rep_platform>x86</rep_platform>
          <op_sys>Multiple</op_sys>
          <bug_status>RESOLVED</bug_status>
          <resolution>FIXED</resolution>
          
          
          <bug_file_loc>https://errors.yoctoproject.org/Errors/Details/233175/</bug_file_loc>
          <status_whiteboard></status_whiteboard>
          <keywords></keywords>
          <priority>Undecided</priority>
          <bug_severity>normal</bug_severity>
          <target_milestone>---</target_milestone>
          
          
          <everconfirmed>1</everconfirmed>
          <reporter name="Armin Kuster">akuster</reporter>
          <assigned_to name="Ross Burton">ross.burton</assigned_to>
          <cc>meta.mr.watcher</cc>
    
    <cc>meta.watcher</cc>
          
          
          <cf_os>---</cf_os>
          <cf_regression_type>---</cf_regression_type>
          
          <cf_docchange>Don&apos;t know</cf_docchange>

      

      

      

          <comment_sort_order>oldest_to_newest</comment_sort_order>  
          <long_desc isprivate="0" >
    <commentid>83280</commentid>
    <comment_count>0</comment_count>
    <who name="Armin Kuster">akuster</who>
    <bug_when>2019-03-18 02:34:17 +0000</bug_when>
    <thetext>ERROR: Command Error: &apos;quilt --quiltrc TOPDIR/tmp/work/i586-poky-linux/python/2.7.15-r1/recipe-sysroot-native/etc/quiltrc push&apos; exited with 0  Output:
Applying patch CVE-2018-14647.patch
patching file Include/pyexpat.h
Hunk #1 FAILED at 3.
Hunk #2 FAILED at 43.
2 out of 2 hunks FAILED -- rejects in file Include/pyexpat.h
The next patch would create the file Misc/NEWS.d/next/Security/2018-09-10-16-05-39.bpo-34623.Ua9jMv.rst,
which already exists!  Applying it anyway.
patching file Misc/NEWS.d/next/Security/2018-09-10-16-05-39.bpo-34623.Ua9jMv.rst
Hunk #1 FAILED at 1.
1 out of 1 hunk FAILED -- rejects in file Misc/NEWS.d/next/Security/2018-09-10-16-05-39.bpo-34623.Ua9jMv.rst
patching file Modules/_elementtree.c
Hunk #1 succeeded at 2579 with fuzz 2 (offset 5 lines).
patching file Modules/pyexpat.c
Hunk #1 FAILED at 2042.
1 out of 1 hunk FAILED -- rejects in file Modules/pyexpat.c
Patch CVE-2018-14647.patch can be reverse-applied</thetext>
  </long_desc><long_desc isprivate="0" >
    <commentid>83281</commentid>
    <comment_count>1</comment_count>
    <who name="Armin Kuster">akuster</who>
    <bug_when>2019-03-18 02:34:35 +0000</bug_when>
    <thetext>this its

http://git.yoctoproject.org/cgit/cgit.cgi/poky-contrib/commit/?h=ross/mut&amp;id=8ae338f253acb0e26b665e7c1ff081410fb22b7f</thetext>
  </long_desc><long_desc isprivate="0" >
    <commentid>83285</commentid>
    <comment_count>2</comment_count>
    <who name="Ross Burton">ross.burton</who>
    <bug_when>2019-03-18 10:46:56 +0000</bug_when>
    <thetext>Fixed in mut</thetext>
  </long_desc>
      
      

    </bug>

</bugzilla>