<?xml version="1.0" encoding="UTF-8" standalone="yes" ?>
<!DOCTYPE bugzilla SYSTEM "https://bugzilla.yoctoproject.org/page.cgi?id=bugzilla.dtd">

<bugzilla version="5.0.6"
          urlbase="https://bugzilla.yoctoproject.org/"
          
          maintainer="it-coreprojects-helpdesk@linuxfoundation.org"
>

    <bug>
          <bug_id>13674</bug_id>
          
          <creation_ts>2019-12-04 13:06:51 +0000</creation_ts>
          <short_desc>master dnf failures on qemumips</short_desc>
          <delta_ts>2025-03-24 09:41:51 +0000</delta_ts>
          <reporter_accessible>1</reporter_accessible>
          <cclist_accessible>1</cclist_accessible>
          <classification_id>7</classification_id>
          <classification>Build System, Metadata &amp; Runtime</classification>
          <product>OE-Core</product>
          <component>core</component>
          <version>3.0</version>
          <rep_platform>x86</rep_platform>
          <op_sys>Multiple</op_sys>
          <bug_status>RESOLVED</bug_status>
          <resolution>FIXED</resolution>
          
          
          <bug_file_loc></bug_file_loc>
          <status_whiteboard>AB-INT</status_whiteboard>
          <keywords></keywords>
          <priority>Medium+</priority>
          <bug_severity>normal</bug_severity>
          <target_milestone>5.2 M4</target_milestone>
          
          
          <everconfirmed>1</everconfirmed>
          <reporter name="Richard Purdie">richard.purdie</reporter>
          <assigned_to name="Unassigned">unassigned</assigned_to>
          <cc>hongxu.jia</cc>
    
    <cc>liezhi.yang</cc>
    
    <cc>mathieu.dubois-briand</cc>
    
    <cc>meta.mr.watcher</cc>
    
    <cc>meta.watcher</cc>
    
    <cc>paulg</cc>
    
    <cc>pavel</cc>
    
    <cc>randy.macleod</cc>
    
    <cc>ross.burton</cc>
    
    <cc>tgamblin</cc>
    
    <cc>yoann.congal</cc>
          
          
          <cf_os>---</cf_os>
          <cf_regression_type>---</cf_regression_type>
          
          <cf_docchange>No (bug/feature does not impact docs)</cf_docchange>

      

      

      

          <comment_sort_order>oldest_to_newest</comment_sort_order>  
          <long_desc isprivate="0" >
    <commentid>85697</commentid>
    <comment_count>0</comment_count>
    <who name="Richard Purdie">richard.purdie</who>
    <bug_when>2019-12-04 13:06:51 +0000</bug_when>
    <thetext>https://autobuilder.yoctoproject.org/typhoon/#/builders/60/builds/1299

NOTE: recipe core-image-sato-1.0-r0: task do_testsdk: Succeeded
Started HTTPService on 192.168.7.7:45100
Started HTTPService on 192.168.7.3:41791
Traceback (most recent call last):
  File &quot;/home/pokybuild/yocto-worker/qemumips/build/meta/lib/oeqa/core/decorator/__init__.py&quot;, line 36, in wrapped_f
    return func(*args, **kwargs)
  File &quot;/home/pokybuild/yocto-worker/qemumips/build/meta/lib/oeqa/runtime/cases/dnf.py&quot;, line 95, in test_dnf_install_dependency
    self.dnf_with_repo(&apos;install -y run-postinsts-dev&apos;)
  File &quot;/home/pokybuild/yocto-worker/qemumips/build/meta/lib/oeqa/runtime/cases/dnf.py&quot;, line 68, in dnf_with_repo
    output = self.dnf(&quot; &quot;.join(cmdlinerepoopts) + &quot; --nogpgcheck &quot; + command)
  File &quot;/home/pokybuild/yocto-worker/qemumips/build/meta/lib/oeqa/runtime/cases/dnf.py&quot;, line 21, in dnf
    self.assertEqual(status, expected, message)
AssertionError: 255 != 0 : dnf --repofrompath=oe-testimage-repo-qemumips,http://192.168.7.7:45100/qemumips --repofrompath=oe-testimage-repo-mips32r2,http://192.168.7.7:45100/mips32r2 --repofrompath=oe-testimage-repo-noarch,http://192.168.7.7:45100/noarch --nogpgcheck install -y run-postinsts-dev
ssh: connect to host 192.168.7.8 port 22: No route to host

Test case dnf.DnfRepoTest.test_dnf_install_from_disk depends on dnf.DnfRepoTest.test_dnf_install_dependency but it didn&apos;t pass/run.
Test case dnf.DnfRepoTest.test_dnf_install_from_http depends on dnf.DnfRepoTest.test_dnf_install_from_disk but it didn&apos;t pass/run.
Traceback (most recent call last):
  File &quot;/home/pokybuild/yocto-worker/qemumips/build/meta/lib/oeqa/core/decorator/__init__.py&quot;, line 36, in wrapped_f
    return func(*args, **kwargs)
  File &quot;/home/pokybuild/yocto-worker/qemumips/build/meta/lib/oeqa/core/decorator/__init__.py&quot;, line 36, in wrapped_f
    return func(*args, **kwargs)
  File &quot;/home/pokybuild/yocto-worker/qemumips/build/meta/lib/oeqa/core/decorator/__init__.py&quot;, line 36, in wrapped_f
    return func(*args, **kwargs)
  File &quot;/home/pokybuild/yocto-worker/qemumips/build/meta/lib/oeqa/runtime/cases/dnf.py&quot;, line 139, in test_dnf_installroot
    self.dnf_with_repo(&apos;install --installroot=%s -v -y --rpmverbosity=debug busybox run-postinsts&apos; % rootpath)
  File &quot;/home/pokybuild/yocto-worker/qemumips/build/meta/lib/oeqa/runtime/cases/dnf.py&quot;, line 68, in dnf_with_repo
    output = self.dnf(&quot; &quot;.join(cmdlinerepoopts) + &quot; --nogpgcheck &quot; + command)
  File &quot;/home/pokybuild/yocto-worker/qemumips/build/meta/lib/oeqa/runtime/cases/dnf.py&quot;, line 21, in dnf
    self.assertEqual(status, expected, message)
AssertionError: 1 != 0 : dnf --repofrompath=oe-testimage-repo-qemumips,http://192.168.7.7:45100/qemumips --repofrompath=oe-testimage-repo-mips32r2,http://192.168.7.7:45100/mips32r2 --repofrompath=oe-testimage-repo-noarch,http://192.168.7.7:45100/noarch --nogpgcheck install --installroot=/home/root/chroot/test -v -y --rpmverbosity=debug busybox run-postinsts
Unable to detect release version (use &apos;--releasever&apos; to specify release version)
DNF version: 4.2.2
cachedir: /home/root/chroot/test/var/cache/dnf
Added oe-testimage-repo-qemumips repo from http://192.168.7.7:45100/qemumips
Added oe-testimage-repo-mips32r2 repo from http://192.168.7.7:45100/mips32r2
Added oe-testimage-repo-noarch repo from http://192.168.7.7:45100/noarch
repo: downloading from remote: oe-testimage-repo-qemumips
oe-testimage-repo-qemumips                      1.6 kB/s | 257  B     00:00    
not found other for: 
not found modules for: 
not found deltainfo for: 
not found updateinfo for: 
oe-testimage-repo-qemumips: using metadata from Tue Dec  3 02:54:27 2019.
repo: downloading from remote: oe-testimage-repo-mips32r2
oe-testimage-repo-mips32r2                      460 kB/s |  43 kB     00:00    
not found other for: 
not found modules for: 
not found deltainfo for: 
not found updateinfo for: 
oe-testimage-repo-mips32r2: using metadata from Tue Dec  3 02:54:27 2019.
repo: downloading from remote: oe-testimage-repo-noarch
oe-testimage-repo-noarch                        5.8 kB/s | 1.4 kB     00:00    
not found other for: 
not found modules for: 
not found deltainfo for: 
not found updateinfo for: 
oe-testimage-repo-noarch: using metadata from Tue Dec  3 02:54:24 2019.
No module defaults found
--&gt; Starting dependency resolution
--&gt; Finished dependency resolution
Error: 
 Problem 1: conflicting requests
  - package busybox-1.31.1-r0.mips32r2 does not have a compatible architecture
  - nothing provides ld.so.1 needed by busybox-1.31.1-r0.mips32r2
  - nothing provides ld.so.1(GLIBC_2.4) needed by busybox-1.31.1-r0.mips32r2
  - nothing provides update-alternatives-opkg needed by busybox-1.31.1-r0.mips32r2
  - nothing provides libc.so.6(GLIBC_2.28) needed by busybox-1.31.1-r0.mips32r2
  - nothing provides libm.so.6 needed by busybox-1.31.1-r0.mips32r2
  - nothing provides libm.so.6(GLIBC_2.0) needed by busybox-1.31.1-r0.mips32r2
  - nothing provides libm.so.6(GLIBC_2.29) needed by busybox-1.31.1-r0.mips32r2
  - nothing provides libc6 &gt;= 2.30 needed by busybox-1.31.1-r0.mips32r2
 Problem 2: conflicting requests
  - nothing provides /bin/sh needed by run-postinsts-1.0-r10.noarch
(try to add &apos;--skip-broken&apos; to skip uninstallable packages or &apos;--nobest&apos; to use not only best candidate packages)

Test run when enable usrmege
Traceback (most recent call last):
  File &quot;/home/pokybuild/yocto-worker/qemumips/build/meta/lib/oeqa/core/decorator/__init__.py&quot;, line 36, in wrapped_f
    return func(*args, **kwargs)
  File &quot;/home/pokybuild/yocto-worker/qemumips/build/meta/lib/oeqa/runtime/cases/dnf.py&quot;, line 116, in test_dnf_reinstall
    self.dnf_with_repo(&apos;reinstall -y run-postinsts-dev&apos;)
  File &quot;/home/pokybuild/yocto-worker/qemumips/build/meta/lib/oeqa/runtime/cases/dnf.py&quot;, line 68, in dnf_with_repo
    output = self.dnf(&quot; &quot;.join(cmdlinerepoopts) + &quot; --nogpgcheck &quot; + command)
  File &quot;/home/pokybuild/yocto-worker/qemumips/build/meta/lib/oeqa/runtime/cases/dnf.py&quot;, line 21, in dnf
    self.assertEqual(status, expected, message)
AssertionError: 1 != 0 : dnf --repofrompath=oe-testimage-repo-qemumips,http://192.168.7.7:45100/qemumips --repofrompath=oe-testimage-repo-mips32r2,http://192.168.7.7:45100/mips32r2 --repofrompath=oe-testimage-repo-noarch,http://192.168.7.7:45100/noarch --nogpgcheck reinstall -y run-postinsts-dev
Added oe-testimage-repo-qemumips repo from http://192.168.7.7:45100/qemumips
Added oe-testimage-repo-mips32r2 repo from http://192.168.7.7:45100/mips32r2
Added oe-testimage-repo-noarch repo from http://192.168.7.7:45100/noarch
Last metadata expiration check: 0:06:05 ago on Tue Dec  3 02:59:16 2019.
Package run-postinsts-dev available, but not installed.
No match for argument: run-postinsts-dev</thetext>
  </long_desc><long_desc isprivate="0" >
    <commentid>85731</commentid>
    <comment_count>1</comment_count>
    <who name="Randy MacLeod">randy.macleod</who>
    <bug_when>2019-12-05 16:09:48 +0000</bug_when>
    <thetext>Occurs relatively rarely (every month or so) but it is important that the autobuilder tests be fixed.</thetext>
  </long_desc><long_desc isprivate="0" >
    <commentid>86424</commentid>
    <comment_count>2</comment_count>
    <who name="Randy MacLeod">randy.macleod</who>
    <bug_when>2020-02-13 16:07:18 +0000</bug_when>
    <thetext>Not seen on autobuilder but it has been encountering other errors so let&apos;s check next week.</thetext>
  </long_desc><long_desc isprivate="0" >
    <commentid>90915</commentid>
    <comment_count>3</comment_count>
    <who name="Randy MacLeod">randy.macleod</who>
    <bug_when>2021-07-13 13:18:50 +0000</bug_when>
    <thetext>Unassigned assuming that this is only mips, I don&apos;t think WR has an interest in this bug.</thetext>
  </long_desc><long_desc isprivate="0" >
    <commentid>96051</commentid>
    <comment_count>4</comment_count>
    <who name="Randy MacLeod">randy.macleod</who>
    <bug_when>2023-07-26 21:21:57 +0000</bug_when>
    <thetext>Bulk move of 64 bugs to 4.3 M3 after a quick review.
If a bug is actually fixed, please add a commit link and resolve it.
-- Randy for YP bug team.</thetext>
  </long_desc><long_desc isprivate="0" >
    <commentid>96459</commentid>
    <comment_count>5</comment_count>
    <who name="Trevor Gamblin">tgamblin</who>
    <bug_when>2023-09-14 16:35:35 +0000</bug_when>
    <thetext>Moved to M4.</thetext>
  </long_desc><long_desc isprivate="0" >
    <commentid>97054</commentid>
    <comment_count>6</comment_count>
    <who name="Randy MacLeod">randy.macleod</who>
    <bug_when>2023-10-30 15:29:08 +0000</bug_when>
    <thetext>Bulk move to 5.0 M1. -- Randy</thetext>
  </long_desc><long_desc isprivate="0" >
    <commentid>97691</commentid>
    <comment_count>7</comment_count>
    <who name="Randy MacLeod">randy.macleod</who>
    <bug_when>2023-12-21 23:28:32 +0000</bug_when>
    <thetext>Bulk move of 52 5.0-M1 bugs to M2.</thetext>
  </long_desc><long_desc isprivate="0" >
    <commentid>97980</commentid>
    <comment_count>8</comment_count>
    <who name="Randy MacLeod">randy.macleod</who>
    <bug_when>2024-01-25 14:28:42 +0000</bug_when>
    <thetext>Bulk move of bugs owned by &quot;unassigned&quot; from 5.0-M2 to 5.0-M3.</thetext>
  </long_desc><long_desc isprivate="0" >
    <commentid>98292</commentid>
    <comment_count>9</comment_count>
    <who name="Randy MacLeod">randy.macleod</who>
    <bug_when>2024-02-22 19:53:21 +0000</bug_when>
    <thetext>Bulk move of bugs from 5.0-M3 to 5.99.
The bugs in this list are all unassigned and are ones that I consider to be nice to do some time but not essential track from milestone to milestone in 5.0 or 5.1. We agreed on this bug handling approach in the YP bug review on Feb 22, 2024.

If you disagree, please move back to a 5.[012...]-M* milestone.</thetext>
  </long_desc><long_desc isprivate="0" >
    <commentid>100460</commentid>
    <comment_count>10</comment_count>
    <who name="Mathieu Dubois-Briand">mathieu.dubois-briand</who>
    <bug_when>2024-12-19 15:18:19 +0000</bug_when>
    <thetext>qemumips64 debian11-vk-2 master completed at 2024-12-15T11:36:09Z
https://valkyrie.yoctoproject.org/#/builders/32/builds/635/steps/14/logs/stdio

qemumips64 debian12-vk-6 mathieu/master-next completed at 2024-12-18T10:18:05Z
https://valkyrie.yoctoproject.org/#/builders/32/builds/662/steps/13/logs/stdio</thetext>
  </long_desc><long_desc isprivate="0" >
    <commentid>100523</commentid>
    <comment_count>11</comment_count>
    <who name="Mathieu Dubois-Briand">mathieu.dubois-briand</who>
    <bug_when>2025-01-03 12:09:13 +0000</bug_when>
    <thetext>Also on ARM:
meta-arm ubuntu2004-vk-2 mathieu/master-next completed at 2024-12-23T10:01:34Z
https://valkyrie.yoctoproject.org/#/builders/75/builds/635/steps/17/logs/stdio

qemumips64 ubuntu2004-vk-3 master completed at 2024-12-26T01:23:12Z
https://valkyrie.yoctoproject.org/#/builders/32/builds/690/steps/14/logs/stdio

And now this one is on qemuarmv5, so maybe the bug seen during the last few days
is not exactly the same as previously.

qemuarmv5 alma9-vk-1 master completed at 2024-12-28T04:21:37Z
https://valkyrie.yoctoproject.org/#/builders/80/builds/641/steps/14/logs/stdio

qemuppc alma9-vk-1 master completed at 2024-12-30T04:02:21Z
https://valkyrie.yoctoproject.org/#/builders/31/builds/707/steps/14/logs/stdio

qemumips64 fedora39-vk-1 master completed at 2025-01-01T01:24:43Z
https://valkyrie.yoctoproject.org/#/builders/32/builds/710/steps/14/logs/stdio

qemumips64 alma9-vk-2 master-next completed at 2025-01-01T12:14:40Z
https://valkyrie.yoctoproject.org/#/builders/32/builds/711/steps/14/logs/stdio

qemumips64 opensuse155-vk-1 mathieu/master-next completed at 2025-01-02T09:44:32Z
https://valkyrie.yoctoproject.org/#/builders/32/builds/714/steps/14/logs/stdio

qemumips64 debian12-vk-8 mathieu/master-next completed at 2025-01-02T17:34:04Z
https://valkyrie.yoctoproject.org/#/builders/32/builds/719/steps/13/logs/stdio</thetext>
  </long_desc><long_desc isprivate="0" >
    <commentid>100648</commentid>
    <comment_count>12</comment_count>
    <who name="Mathieu Dubois-Briand">mathieu.dubois-briand</who>
    <bug_when>2025-01-15 13:08:55 +0000</bug_when>
    <thetext>qemumips64 alma9-vk-1 abelloni/master-next completed at 2025-01-05T19:57:32Z
https://valkyrie.yoctoproject.org/#/builders/32/builds/736/steps/14/logs/stdio

qemumips64 rocky9-vk-1 master completed at 2025-01-06T01:32:04Z
https://valkyrie.yoctoproject.org/#/builders/32/builds/737/steps/14/logs/stdio

qemumips64 debian11-vk-1 abelloni/master-next completed at 2025-01-06T11:25:01Z
https://valkyrie.yoctoproject.org/#/builders/32/builds/738/steps/14/logs/stdio

qemumips64 alma9-vk-1 master-next completed at 2025-01-06T15:08:13Z
https://valkyrie.yoctoproject.org/#/builders/32/builds/739/steps/14/logs/stdio

qemumips64 stream9-vk-1 master completed at 2025-01-07T01:33:36Z
https://valkyrie.yoctoproject.org/#/builders/32/builds/744/steps/14/logs/stdio

qemumips64 ubuntu2204-vk-4 master-next completed at 2025-01-07T22:57:15Z
https://valkyrie.yoctoproject.org/#/builders/32/builds/754/steps/14/logs/stdio

meta-arm alma8-vk-2 abelloni/master-next completed at 2025-01-12T19:45:43Z
https://valkyrie.yoctoproject.org/#/builders/75/builds/731/steps/18/logs/stdio</thetext>
  </long_desc><long_desc isprivate="0" >
    <commentid>100695</commentid>
    <comment_count>13</comment_count>
    <who name="Mathieu Dubois-Briand">mathieu.dubois-briand</who>
    <bug_when>2025-01-20 08:39:05 +0000</bug_when>
    <thetext>meta-arm debian11-vk-1 master-next completed at 2025-01-17T11:41:58Z
https://autobuilder.yoctoproject.org/valkyrie/#/builders/75/builds/762/steps/17/logs/stdio

qemumips64 rocky9-vk-2 master-next completed at 2025-01-16T12:11:38Z
https://autobuilder.yoctoproject.org/valkyrie/#/builders/32/builds/808/steps/14/logs/stdio</thetext>
  </long_desc><long_desc isprivate="0" >
    <commentid>100697</commentid>
    <comment_count>14</comment_count>
    <who name="Robert Yang">liezhi.yang</who>
    <bug_when>2025-01-20 08:40:23 +0000</bug_when>
    <thetext>it&apos;s strange, I tried it many times locally, but can&apos;t reproduce the error</thetext>
  </long_desc><long_desc isprivate="0" >
    <commentid>100715</commentid>
    <comment_count>15</comment_count>
    <who name="Mathieu Dubois-Briand">mathieu.dubois-briand</who>
    <bug_when>2025-01-22 14:14:22 +0000</bug_when>
    <thetext>qemumips64 ubuntu2404-vk-2 mathieu/master-next completed at 2025-01-22T09:55:12Z
https://autobuilder.yoctoproject.org/valkyrie/#/builders/32/builds/848/steps/13/logs/stdio

qemumips64 ubuntu2004-vk-1 master-next completed at 2025-01-22T12:21:01Z
https://autobuilder.yoctoproject.org/valkyrie/#/builders/32/builds/850/steps/14/logs/stdio</thetext>
  </long_desc><long_desc isprivate="0" >
    <commentid>100740</commentid>
    <comment_count>16</comment_count>
    <who name="Richard Purdie">richard.purdie</who>
    <bug_when>2025-01-24 14:52:51 +0000</bug_when>
    <thetext>I did a deep dive into one of these. 

https://autobuilder.yocto.io/pub/failed-builds-data/qemumips64-dnf/log.do_testimage.293138 - is the testimage log of the test_dnf_installroot test failure.

Inside https://autobuilder.yocto.io/pub/failed-builds-data/qemumips64-dnf/tests_artifacts.tar.gz is a dnf.rpm.log 

There is weirdness is this set of lines:

2025-01-22T19:42:32+0000 INFO --- logging initialized ---
2025-01-22T19:43:22+0000 SUBDEBUG Reinstall: dnf-test-main-4.22.0-r0.mips64r2
2025-01-22T19:43:22+0000 SUBDEBUG Reinstalled: dnf-test-main-4.22.0-r0.mips64r2
2025-01-22T19:43:44+0000 INFO --- logging initialized ---

2025-01-22T19:46:00+0000 INFO D: exiting chroot /home/root/chroot/test/

which implies the reinstall test is running when the installroot test is still active too. Since the installroot is separate, that is possible.

The ssh connection for the test seems to fail, exit code 255. I don&apos;t believe the command fails, I believe the connection fails.

In the &quot;messages&quot; log in the above archive, there is also this:

Jan 22 19:40:34 qemumips64 authpriv.info dropbear[693]: Child connection from 192.168.7.1:41410
Jan 22 19:40:34 qemumips64 authpriv.notice dropbear[693]: Auth succeeded with blank password for &apos;root&apos; from 192.168.7.1:41410
Jan 22 19:42:05 qemumips64 authpriv.info dropbear[2213]: Child connection from 192.168.7.1:44380
Jan 22 19:42:07 qemumips64 authpriv.notice dropbear[2213]: Auth succeeded with blank password for &apos;root&apos; from 192.168.7.1:44380
Jan 22 19:43:22 qemumips64 authpriv.info dropbear[693]: Exit (root) from &lt;192.168.7.1:41410&gt;: Error writing: Broken pipe
Jan 22 19:43:27 qemumips64 authpriv.info dropbear[2213]: Exit (root) from &lt;192.168.7.1:44380&gt;: Disconnect received
Jan 22 19:43:27 qemumips64 authpriv.info dropbear[3541]: Child connection from 192.168.7.1:40790

i.e. it failed to write to the remote.

I was wondering if the ssh server had OOM&apos;d however this looks like like the networking to 192.168.7.1 glitched.</thetext>
  </long_desc><long_desc isprivate="0" >
    <commentid>100753</commentid>
    <comment_count>17</comment_count>
    <who name="Mathieu Dubois-Briand">mathieu.dubois-briand</who>
    <bug_when>2025-01-27 13:39:06 +0000</bug_when>
    <thetext>qemumips64 rocky9-vk-1 master-next completed at 2025-01-22T19:52:41Z
https://autobuilder.yoctoproject.org/valkyrie/#/builders/32/builds/857/steps/14/logs/stdio</thetext>
  </long_desc><long_desc isprivate="0" >
    <commentid>100769</commentid>
    <comment_count>18</comment_count>
    <who name="Mathieu Dubois-Briand">mathieu.dubois-briand</who>
    <bug_when>2025-01-30 08:46:14 +0000</bug_when>
    <thetext>qemumips64 debian12-vk-9 mathieu/master-next completed at 2025-01-27T08:38:55Z
https://autobuilder.yoctoproject.org/valkyrie/#/builders/32/builds/882/steps/13/logs/stdio</thetext>
  </long_desc><long_desc isprivate="0" >
    <commentid>100778</commentid>
    <comment_count>19</comment_count>
    <who name="Ross Burton">ross.burton</who>
    <bug_when>2025-01-30 15:49:49 +0000</bug_when>
    <thetext>Potentially maybe fixed with oe-core 9d91a5674c515a43ae76d8615f72e5e2dc16c961?</thetext>
  </long_desc><long_desc isprivate="0" >
    <commentid>100785</commentid>
    <comment_count>20</comment_count>
    <who name="Randy MacLeod">randy.macleod</who>
    <bug_when>2025-01-30 16:05:05 +0000</bug_when>
    <thetext>Bulk move.</thetext>
  </long_desc><long_desc isprivate="0" >
    <commentid>100856</commentid>
    <comment_count>21</comment_count>
    <who name="Mathieu Dubois-Briand">mathieu.dubois-briand</who>
    <bug_when>2025-02-06 14:58:36 +0000</bug_when>
    <thetext>qemumips64 debian12-vk-4 mathieu/master-next completed at 2025-02-06T12:08:28Z
https://autobuilder.yoctoproject.org/valkyrie/#/builders/32/builds/937/steps/13/logs/stdio</thetext>
  </long_desc><long_desc isprivate="0" >
    <commentid>100893</commentid>
    <comment_count>22</comment_count>
    <who name="Mathieu Dubois-Briand">mathieu.dubois-briand</who>
    <bug_when>2025-02-10 13:02:01 +0000</bug_when>
    <thetext>qemumips64 opensuse155-vk-1 master-next completed at 2025-02-07T12:08:35Z
Lot of dnf failures this week because of bad patches. I believe this one is
because of the AB-INT, but I might be wrong.
https://autobuilder.yoctoproject.org/valkyrie/#/builders/32/builds/948/steps/15/logs/stdio</thetext>
  </long_desc><long_desc isprivate="0" >
    <commentid>100904</commentid>
    <comment_count>23</comment_count>
    <who name="Mathieu Dubois-Briand">mathieu.dubois-briand</who>
    <bug_when>2025-02-12 14:39:24 +0000</bug_when>
    <thetext>qemumips64 ubuntu2004-vk-2 master completed at 2025-02-12T02:11:54Z
https://autobuilder.yoctoproject.org/valkyrie/#/builders/32/builds/980/steps/14/logs/stdio</thetext>
  </long_desc><long_desc isprivate="0" >
    <commentid>100937</commentid>
    <comment_count>24</comment_count>
    <who name="Randy MacLeod">randy.macleod</who>
    <bug_when>2025-02-13 15:44:05 +0000</bug_when>
    <thetext>Robert, this is a frequent issue for the YP AB. Can we get someone working on this ASAP?</thetext>
  </long_desc><long_desc isprivate="0" >
    <commentid>101286</commentid>
    <comment_count>25</comment_count>
    <who name="Mathieu Dubois-Briand">mathieu.dubois-briand</who>
    <bug_when>2025-03-05 08:37:09 +0000</bug_when>
    <thetext>qemumips64 opensuse156-vk-1 master-next completed at 2025-03-03T13:44:13Z
https://autobuilder.yoctoproject.org/valkyrie/#/builders/32/builds/1091/steps/15/logs/stdio</thetext>
  </long_desc><long_desc isprivate="0" >
    <commentid>101328</commentid>
    <comment_count>26</comment_count>
    <who name="Mathieu Dubois-Briand">mathieu.dubois-briand</who>
    <bug_when>2025-03-10 09:43:02 +0000</bug_when>
    <thetext>qemumips64 debian12-vk-1 mathieu/master-next completed at 2025-03-07T07:23:32Z
https://autobuilder.yoctoproject.org/valkyrie/#/builders/32/builds/1119/steps/13/logs/stdio

qemumips64 ubuntu2004-vk-1 master completed at 2025-03-07T12:07:33Z
https://autobuilder.yoctoproject.org/valkyrie/#/builders/32/builds/1122/steps/14/logs/stdio</thetext>
  </long_desc><long_desc isprivate="0" >
    <commentid>101361</commentid>
    <comment_count>27</comment_count>
    <who name="Mathieu Dubois-Briand">mathieu.dubois-briand</who>
    <bug_when>2025-03-13 09:29:52 +0000</bug_when>
    <thetext>qemumips64 alma8-vk-2 master-next completed at 2025-03-12T17:36:12Z
https://autobuilder.yoctoproject.org/valkyrie/#/builders/32/builds/1159/steps/15/logs/stdio</thetext>
  </long_desc><long_desc isprivate="0" >
    <commentid>101371</commentid>
    <comment_count>28</comment_count>
    <who name="Randy MacLeod">randy.macleod</who>
    <bug_when>2025-03-13 14:52:37 +0000</bug_when>
    <thetext>This is a difficult bug to reproduce, it&apos;s likely load related.
Can we add some logs to help diagnose the issue.</thetext>
  </long_desc><long_desc isprivate="0" >
    <commentid>101375</commentid>
    <comment_count>29</comment_count>
    <who name="Randy MacLeod">randy.macleod</who>
    <bug_when>2025-03-13 18:42:31 +0000</bug_when>
    <thetext>Something along the lines of the &apos;run_cmds&apos; function in :
https://git.yoctoproject.org/poky/tree/scripts/oe-time-dd-test.sh#n31

This is rather verbose so we have an offline script to generate a summary:
https://git.yoctoproject.org/yocto-autobuilder-helper/tree/scripts/summarize_top_output.py

It&apos;s not clear to me what the conditions merit such data collection.
I&apos;m off work tomorrow  (Friday) so I&apos;ll try to make time to work on that next week if no one has gotten there first.</thetext>
  </long_desc><long_desc isprivate="0" >
    <commentid>101382</commentid>
    <comment_count>30</comment_count>
    <who name="Richard Purdie">richard.purdie</who>
    <bug_when>2025-03-16 22:51:31 +0000</bug_when>
    <thetext>Locally I couldn&apos;t reproduce this.

I tried to reproduce using a failed autobuilder build directory and initially it didn&apos;t. When there were builds running in parallel (including an oe-selftest), it did reproduce.

Locally, I did manage test failures with ssh hanging if I ran &quot;cpulimit -l 50&quot; on the qemu pid as it started from a &quot;bitbake core-image-sato -c testimage&quot; but not the same test failure. The kernel looks showed rcu-stalls and weird timestamps.</thetext>
  </long_desc><long_desc isprivate="0" >
    <commentid>101383</commentid>
    <comment_count>31</comment_count>
    <who name="Richard Purdie">richard.purdie</who>
    <bug_when>2025-03-17 00:17:07 +0000</bug_when>
    <thetext>I noticed there is a suspicious looking CONFIG_QEMUMIPS64 kernel config we&apos;re nt setting which changes clock/interrupt config.

sched_clock: 64 bits at 100 Hz, resolution 10000000ns, wraps every 36028797015000000ns

becomes:

clocksource: MIPS: mask: 0xffffffff max_cycles: 0xffffffff, max_idle_ns: 11945313065 ns
sched_clock: 32 bits at 160MHz, resolution 6ns, wraps every 13421700092ns
clocksource: Switched to clocksource MIPS

with that config set. We should probably try setting that and seeing if these issues change in frequency.</thetext>
  </long_desc><long_desc isprivate="0" >
    <commentid>101384</commentid>
    <comment_count>32</comment_count>
    <who name="Paul Gortmaker">paulg</who>
    <bug_when>2025-03-17 00:34:36 +0000</bug_when>
    <thetext>I do 100% agree.  Using a 100Hz jiffy clock is so y2k that it is not funny.  It made sense back in the day as a valid trade-off in order to optimize toward bulk processing with a larger time slice on these old processors, before scribbling the tiny cache with a timer interrupt.

But time moves on, and even 15(?) years ago the default was 1kHz because processors got faster and people started to care about resolution.

Using a 6.x kernel on an ancient CPU model with a 100Hz clock definitely puts us in a spot where very few (if nobody else?) is testing.</thetext>
  </long_desc><long_desc isprivate="0" >
    <commentid>101388</commentid>
    <comment_count>33</comment_count>
    <who name="Richard Purdie">richard.purdie</who>
    <bug_when>2025-03-17 12:57:18 +0000</bug_when>
    <thetext>CONFIG_QEMUMIPS64 comes from one of our kernel patches. This disables a couple of different clock sources.

Looking at upstream, there is https://web.git.kernel.org/pub/scm/linux/kernel/git/torvalds/linux.git/commit/arch/mips?id=078b831638e1aa06dd7ffa9f244c8ac6b2995561 which also changes one of the two clock sources the above changes.

Testing locally, I don&apos;t see the rcu-stalls with this backported so I think the best thing we can do is backport the above revert from mainline.</thetext>
  </long_desc><long_desc isprivate="0" >
    <commentid>101391</commentid>
    <comment_count>34</comment_count>
    <who name="Mathieu Dubois-Briand">mathieu.dubois-briand</who>
    <bug_when>2025-03-17 15:33:02 +0000</bug_when>
    <thetext>qemumips64 alma9-vk-2 master completed at 2025-03-14T01:24:20Z
https://autobuilder.yoctoproject.org/valkyrie/#/builders/32/builds/1170/steps/14/logs/stdio</thetext>
  </long_desc><long_desc isprivate="0" >
    <commentid>101402</commentid>
    <comment_count>35</comment_count>
    <who name="Mathieu Dubois-Briand">mathieu.dubois-briand</who>
    <bug_when>2025-03-18 09:53:07 +0000</bug_when>
    <thetext>qemumips64 ubuntu2204-vk-2 master-next completed at 2025-03-17T22:52:25Z
https://autobuilder.yoctoproject.org/valkyrie/#/builders/32/builds/1186/steps/14/logs/stdio</thetext>
  </long_desc><long_desc isprivate="0" >
    <commentid>101430</commentid>
    <comment_count>36</comment_count>
    <who name="Mathieu Dubois-Briand">mathieu.dubois-briand</who>
    <bug_when>2025-03-20 14:11:31 +0000</bug_when>
    <thetext>qemumips64 alma9-vk-2 master-next completed at 2025-03-19T15:45:45Z
https://autobuilder.yoctoproject.org/valkyrie/#/builders/32/builds/1202/steps/14/logs/stdio</thetext>
  </long_desc><long_desc isprivate="0" >
    <commentid>101468</commentid>
    <comment_count>37</comment_count>
    <who name="Richard Purdie">richard.purdie</who>
    <bug_when>2025-03-24 09:41:51 +0000</bug_when>
    <thetext>The fix was included in the kernel upgrade:

https://git.yoctoproject.org/poky/commit/?id=808fb969bc8c3dafda87ddfd813fae832eb6917c

so we&apos;ll work on the basis that fixes this. We should start a new bug for any issuea after this is merged.</thetext>
  </long_desc>
      
      

    </bug>

</bugzilla>