<?xml version="1.0" encoding="UTF-8" standalone="yes" ?>
<!DOCTYPE bugzilla SYSTEM "https://bugzilla.yoctoproject.org/page.cgi?id=bugzilla.dtd">

<bugzilla version="5.0.6"
          urlbase="https://bugzilla.yoctoproject.org/"
          
          maintainer="it-coreprojects-helpdesk@linuxfoundation.org"
>

    <bug>
          <bug_id>13676</bug_id>
          
          <creation_ts>2019-12-04 13:48:06 +0000</creation_ts>
          <short_desc>selftest  test_gdb_hardlink_debug failure</short_desc>
          <delta_ts>2020-08-27 10:28:16 +0000</delta_ts>
          <reporter_accessible>1</reporter_accessible>
          <cclist_accessible>1</cclist_accessible>
          <classification_id>7</classification_id>
          <classification>Build System, Metadata &amp; Runtime</classification>
          <product>OE-Core</product>
          <component>core</component>
          <version>3.0</version>
          <rep_platform>x86</rep_platform>
          <op_sys>Multiple</op_sys>
          <bug_status>RESOLVED</bug_status>
          <resolution>DUPLICATE</resolution>
          <dup_id>13123</dup_id>
          
          <bug_file_loc></bug_file_loc>
          <status_whiteboard></status_whiteboard>
          <keywords></keywords>
          <priority>Medium+</priority>
          <bug_severity>normal</bug_severity>
          <target_milestone>3.2 M3</target_milestone>
          
          
          <everconfirmed>1</everconfirmed>
          <reporter name="Richard Purdie">richard.purdie</reporter>
          <assigned_to name="Randy MacLeod">randy.macleod</assigned_to>
          <cc>meta.mr.watcher</cc>
    
    <cc>meta.watcher</cc>
    
    <cc>randy.macleod</cc>
          
          
          <cf_os>---</cf_os>
          <cf_regression_type>---</cf_regression_type>
          
          <cf_docchange>No (bug/feature does not impact docs)</cf_docchange>

      

      

      

          <comment_sort_order>oldest_to_newest</comment_sort_order>  
          <long_desc isprivate="0" >
    <commentid>85700</commentid>
    <comment_count>0</comment_count>
    <who name="Richard Purdie">richard.purdie</who>
    <bug_when>2019-12-04 13:48:06 +0000</bug_when>
    <thetext>https://autobuilder.yoctoproject.org/typhoon/#/builders/56/builds/844

2019-12-04 02:31:38,889 - oe-selftest - INFO - ======================================================================
2019-12-04 02:31:39,008 - oe-selftest - INFO - FAIL: package.PackageTests.test_gdb_hardlink_debug (subunit.RemotedTestCase)
2019-12-04 02:31:39,008 - oe-selftest - INFO - ----------------------------------------------------------------------
2019-12-04 02:31:39,008 - oe-selftest - INFO - testtools.testresult.real._StringException: Traceback (most recent call last):
  File &quot;/home/pokybuild/yocto-worker/oe-selftest/build/meta/lib/oeqa/selftest/cases/package.py&quot;, line 150, in test_gdb_hardlink_debug
    self.fail(&apos;GDB %s failed&apos; % binary)
  File &quot;/opt/poky/3.0/sysroots/x86_64-pokysdk-linux/usr/lib/python3.7/unittest/case.py&quot;, line 693, in fail
    raise self.failureException(msg)
AssertionError: GDB /usr/bin/hello1 failed

At the very least we need to improve this failure output to aid debugging what really went wrong.</thetext>
  </long_desc><long_desc isprivate="0" >
    <commentid>85717</commentid>
    <comment_count>1</comment_count>
    <who name="Ross Burton">ross.burton</who>
    <bug_when>2019-12-04 21:26:47 +0000</bug_when>
    <thetext>Further context from the log:

2019-12-03 16:22:31,628 - oe-selftest - ERROR - GDB result:
0: Reading symbols from /usr/bin/hello1...
Reading symbols from /usr/bin/.debug/hello1...
(gdb) Breakpoint 1 at 0x1050: file /usr/include/bits/stdio2.h, line 107.
(gdb) Starting program: /usr/bin/hello1 
&lt;&lt;&lt; run_serial(): command timed out after 60 seconds without output &gt;&gt;&gt;

Considering hello1 is just a printf() statement, was this machine massively loaded at the time?</thetext>
  </long_desc><long_desc isprivate="0" >
    <commentid>87139</commentid>
    <comment_count>2</comment_count>
    <who name="Richard Purdie">richard.purdie</who>
    <bug_when>2020-05-03 06:35:47 +0000</bug_when>
    <thetext>https://autobuilder.yoctoproject.org/typhoon/#/builders/86/builds/904</thetext>
  </long_desc><long_desc isprivate="0" >
    <commentid>88050</commentid>
    <comment_count>3</comment_count>
    <who name="Randy MacLeod">randy.macleod</who>
    <bug_when>2020-08-27 10:28:16 +0000</bug_when>
    <thetext>Duplicate so close the this one as it is more recent.

*** This bug has been marked as a duplicate of bug 13123 ***</thetext>
  </long_desc>
      
      

    </bug>

</bugzilla>