<?xml version="1.0" encoding="UTF-8" standalone="yes" ?>
<!DOCTYPE bugzilla SYSTEM "https://bugzilla.yoctoproject.org/page.cgi?id=bugzilla.dtd">

<bugzilla version="5.0.6"
          urlbase="https://bugzilla.yoctoproject.org/"
          
          maintainer="it-coreprojects-helpdesk@linuxfoundation.org"
>

    <bug>
          <bug_id>13692</bug_id>
          
          <creation_ts>2019-12-07 16:22:14 +0000</creation_ts>
          <short_desc>master-next] Build perf failed do to debianutils failing</short_desc>
          <delta_ts>2019-12-12 15:51:22 +0000</delta_ts>
          <reporter_accessible>1</reporter_accessible>
          <cclist_accessible>1</cclist_accessible>
          <classification_id>7</classification_id>
          <classification>Build System, Metadata &amp; Runtime</classification>
          <product>OE-Core</product>
          <component>core</component>
          <version>3.1</version>
          <rep_platform>x86</rep_platform>
          <op_sys>Multiple</op_sys>
          <bug_status>RESOLVED</bug_status>
          <resolution>OBSOLETE</resolution>
          
          
          <bug_file_loc></bug_file_loc>
          <status_whiteboard></status_whiteboard>
          <keywords></keywords>
          <priority>Undecided</priority>
          <bug_severity>normal</bug_severity>
          <target_milestone>---</target_milestone>
          
          
          <everconfirmed>1</everconfirmed>
          <reporter name="Armin Kuster">akuster</reporter>
          <assigned_to name="Ross Burton">ross.burton</assigned_to>
          <cc>meta.mr.watcher</cc>
    
    <cc>meta.watcher</cc>
    
    <cc>richard.purdie</cc>
          
          
          <cf_os>---</cf_os>
          <cf_regression_type>---</cf_regression_type>
          
          <cf_docchange>Don&apos;t know</cf_docchange>

      

      

      

          <comment_sort_order>oldest_to_newest</comment_sort_order>  
          <long_desc isprivate="0" >
    <commentid>85764</commentid>
    <comment_count>0</comment_count>
    <who name="Armin Kuster">akuster</who>
    <bug_when>2019-12-07 16:22:14 +0000</bug_when>
    <thetext>ERROR: test1 (oeqa.buildperf.test_basic.Test1P1)
Build core-image-sato
----------------------------------------------------------------------
Traceback (most recent call last):
  File &quot;/home/pokybuild/yocto-worker/buildperf-centos7/build/meta/lib/oeqa/buildperf/test_basic.py&quot;, line 23, in test1
    &apos;bitbake &apos; + self.build_target, save_bs=True)
  File &quot;/home/pokybuild/yocto-worker/buildperf-centos7/build/meta/lib/oeqa/buildperf/base.py&quot;, line 346, in measure_cmd_resources
    raise data
oeqa.utils.CommandError: Command &apos;[&apos;bitbake&apos;, &apos;core-image-sato&apos;]&apos; returned non-zero exit status 1 with output: 
... (last 40 lines of output)
| make[2]: Leaving directory &apos;/home/pokybuild/build-perf-test/build-595706a9b0-20191207122955/tmp/work/x86_64-linux/debianutils-native/4.9-r0/build/po4a/sl&apos;
| make[2]: Entering directory &apos;/home/pokybuild/build-perf-test/build-595706a9b0-20191207122955/tmp/work/x86_64-linux/debianutils-native/4.9-r0/build/po4a&apos;
| make[2]: Nothing to be done for &apos;all-am&apos;.
| make[2]: Leaving directory &apos;/home/pokybuild/build-perf-test/build-595706a9b0-20191207122955/tmp/work/x86_64-linux/debianutils-native/4.9-r0/build/po4a&apos;
| make[1]: Leaving directory &apos;/home/pokybuild/build-perf-test/build-595706a9b0-20191207122955/tmp/work/x86_64-linux/debianutils-native/4.9-r0/build/po4a&apos;
| make[1]: Entering directory &apos;/home/pokybuild/build-perf-test/build-595706a9b0-20191207122955/tmp/work/x86_64-linux/debianutils-native/4.9-r0/build&apos;
| gcc  -DPACKAGE_NAME=\&quot;debianutils\&quot; -DPACKAGE_TARNAME=\&quot;debianutils\&quot; -DPACKAGE_VERSION=\&quot;4.8.6\&quot; -DPACKAGE_STRING=\&quot;debianutils\ 4.8.6\&quot; -DPACKAGE_BUGREPORT=\&quot;\&quot; -DPACKAGE_URL=\&quot;\&quot; -DPACKAGE=\&quot;debianutils\&quot; -DVERSION=\&quot;4.8.6\&quot; -DSTDC_HEADERS=1 -DHAVE_SYS_TYPES_H=1 -DHAVE_SYS_STAT_H=1 -DHAVE_STDLIB_H=1 -DHAVE_STRING_H=1 -DHAVE_MEMORY_H=1 -DHAVE_STRINGS_H=1 -DHAVE_INTTYPES_H=1 -DHAVE_STDINT_H=1 -DHAVE_UNISTD_H=1 -DHAVE_PATHS_H=1 -DHAVE_GETOPT_H=1 -I. -I../debianutils-4.9   -isystem/home/pokybuild/build-perf-test/build-595706a9b0-20191207122955/tmp/work/x86_64-linux/debianutils-native/4.9-r0/recipe-sysroot-native/usr/include  -isystem/home/pokybuild/build-perf-test/build-595706a9b0-20191207122955/tmp/work/x86_64-linux/debianutils-native/4.9-r0/recipe-sysroot-native/usr/include -O2 -pipe -c -o run-parts.o ../debianutils-4.9/run-parts.c
| gcc  -DPACKAGE_NAME=\&quot;debianutils\&quot; -DPACKAGE_TARNAME=\&quot;debianutils\&quot; -DPACKAGE_VERSION=\&quot;4.8.6\&quot; -DPACKAGE_STRING=\&quot;debianutils\ 4.8.6\&quot; -DPACKAGE_BUGREPORT=\&quot;\&quot; -DPACKAGE_URL=\&quot;\&quot; -DPACKAGE=\&quot;debianutils\&quot; -DVERSION=\&quot;4.8.6\&quot; -DSTDC_HEADERS=1 -DHAVE_SYS_TYPES_H=1 -DHAVE_SYS_STAT_H=1 -DHAVE_STDLIB_H=1 -DHAVE_STRING_H=1 -DHAVE_MEMORY_H=1 -DHAVE_STRINGS_H=1 -DHAVE_INTTYPES_H=1 -DHAVE_STDINT_H=1 -DHAVE_UNISTD_H=1 -DHAVE_PATHS_H=1 -DHAVE_GETOPT_H=1 -I. -I../debianutils-4.9   -isystem/home/pokybuild/build-perf-test/build-595706a9b0-20191207122955/tmp/work/x86_64-linux/debianutils-native/4.9-r0/recipe-sysroot-native/usr/include  -isystem/home/pokybuild/build-perf-test/build-595706a9b0-20191207122955/tmp/work/x86_64-linux/debianutils-native/4.9-r0/recipe-sysroot-native/usr/include -O2 -pipe -c -o tempfile.o ../debianutils-4.9/tempfile.c
| gcc  -DPACKAGE_NAME=\&quot;debianutils\&quot; -DPACKAGE_TARNAME=\&quot;debianutils\&quot; -DPACKAGE_VERSION=\&quot;4.8.6\&quot; -DPACKAGE_STRING=\&quot;debianutils\ 4.8.6\&quot; -DPACKAGE_BUGREPORT=\&quot;\&quot; -DPACKAGE_URL=\&quot;\&quot; -DPACKAGE=\&quot;debianutils\&quot; -DVERSION=\&quot;4.8.6\&quot; -DSTDC_HEADERS=1 -DHAVE_SYS_TYPES_H=1 -DHAVE_SYS_STAT_H=1 -DHAVE_STDLIB_H=1 -DHAVE_STRING_H=1 -DHAVE_MEMORY_H=1 -DHAVE_STRINGS_H=1 -DHAVE_INTTYPES_H=1 -DHAVE_STDINT_H=1 -DHAVE_UNISTD_H=1 -DHAVE_PATHS_H=1 -DHAVE_GETOPT_H=1 -I. -I../debianutils-4.9   -isystem/home/pokybuild/build-perf-test/build-595706a9b0-20191207122955/tmp/work/x86_64-linux/debianutils-native/4.9-r0/recipe-sysroot-native/usr/include  -isystem/home/pokybuild/build-perf-test/build-595706a9b0-20191207122955/tmp/work/x86_64-linux/debianutils-native/4.9-r0/recipe-sysroot-native/usr/include -O2 -pipe -c -o ischroot.o ../debianutils-4.9/ischroot.c
| ../debianutils-4.9/run-parts.c: In function ‘copy_stdin’:
| ../debianutils-4.9/run-parts.c:404:21: error: ‘O_TMPFILE’ undeclared (first use in this function)
|    fd = open(tmpdir, O_TMPFILE|O_RDWR|O_EXCL, S_IRUSR | S_IWUSR);
|                      ^
| ../debianutils-4.9/run-parts.c:404:21: note: each undeclared identifier is reported only once for each function it appears in
| make[1]: *** [Makefile:550: run-parts.o] Error 1
| make[1]: *** Waiting for unfinished jobs....
| make[1]: Leaving directory &apos;/home/pokybuild/build-perf-test/build-595706a9b0-20191207122955/tmp/work/x86_64-linux/debianutils-native/4.9-r0/build&apos;
| make: *** [Makefile:652: all-recursive] Error 1
| WARNING: /home/pokybuild/build-perf-test/build-595706a9b0-20191207122955/tmp/work/x86_64-linux/debianutils-native/4.9-r0/temp/run.do_compile.8618:1 exit 1 from &apos;exit 1&apos;
|</thetext>
  </long_desc><long_desc isprivate="0" >
    <commentid>85805</commentid>
    <comment_count>1</comment_count>
    <who name="Ross Burton">ross.burton</who>
    <bug_when>2019-12-12 15:51:22 +0000</bug_when>
    <thetext>master-next with the new debianutils which fails with older glibc.

Already dropped from next.</thetext>
  </long_desc>
      
      

    </bug>

</bugzilla>