<?xml version="1.0" encoding="UTF-8" standalone="yes" ?>
<!DOCTYPE bugzilla SYSTEM "https://bugzilla.yoctoproject.org/page.cgi?id=bugzilla.dtd">

<bugzilla version="5.0.6"
          urlbase="https://bugzilla.yoctoproject.org/"
          
          maintainer="it-coreprojects-helpdesk@linuxfoundation.org"
>

    <bug>
          <bug_id>1373</bug_id>
          
          <creation_ts>2011-08-16 01:21:09 +0000</creation_ts>
          <short_desc>bluez-hcidump compiling fails</short_desc>
          <delta_ts>2011-08-18 21:55:26 +0000</delta_ts>
          <reporter_accessible>1</reporter_accessible>
          <cclist_accessible>1</cclist_accessible>
          <classification_id>7</classification_id>
          <classification>Build System, Metadata &amp; Runtime</classification>
          <product>OE-Core</product>
          <component>connectivity</component>
          <version>unspecified</version>
          <rep_platform>x86</rep_platform>
          <op_sys>Multiple</op_sys>
          <bug_status>RESOLVED</bug_status>
          <resolution>DUPLICATE</resolution>
          <dup_id>1371</dup_id>
          
          <bug_file_loc></bug_file_loc>
          <status_whiteboard></status_whiteboard>
          <keywords></keywords>
          <priority>Medium</priority>
          <bug_severity>critical</bug_severity>
          <target_milestone>1.1 M4</target_milestone>
          
          
          <everconfirmed>1</everconfirmed>
          <reporter name="Tong Lin">tong.lin</reporter>
          <assigned_to name="Dongxiao Xu">dongxiao.xu</assigned_to>
          <cc>lianhao.lu</cc>
    
    <cc>meta.mr.watcher</cc>
    
    <cc>meta.watcher</cc>
    
    <cc>poky.bs.watcher</cc>
    
    <cc>poky.watcher</cc>
    
    <cc>sgw</cc>
          
          
          <cf_os>---</cf_os>
          <cf_regression_type>---</cf_regression_type>
          
          <cf_docchange>---</cf_docchange>

      

      

      

          <comment_sort_order>oldest_to_newest</comment_sort_order>  
          <long_desc isprivate="0" >
    <commentid>15481</commentid>
    <comment_count>0</comment_count>
    <who name="Tong Lin">tong.lin</who>
    <bug_when>2011-08-16 01:21:09 +0000</bug_when>
    <thetext>when I use command: bitbake core-image-sato-sdk, the building fails. It shows that bluez-hcidump&apos;s compile step fails as following:


| make[1]: *** [src/hcidump.o] Error 1
| make[1]: *** Waiting for unfinished jobs....
| make: *** [all] Error 2
| ERROR: oe_runmake failed
| ERROR: Function &apos;do_compile&apos; failed (see

and the log messages are as following:

src/hcidump.c:54:24: error: redefinition of &apos;ntoh64&apos; 
/distro/tlin100/adt-test/poky/build/tmp/sysroots/qemux86/usr/include/bluetooth/bluetooth.h:185:24:
note: previous definition of &apos;ntoh64&apos; was here 
make[1]: *** [src/hcidump.o] Error 1 
make[1]: *** Waiting for unfinished jobs.... 
make: *** [all] Error 2 
ERROR: oe_runmake failed 
ERROR: Function &apos;do_compile&apos; failed (see
/distro/tlin100/adt-test/poky/build/tmp/work/i586-poky-linux/bluez-hcidump-2.0-r0/temp/log.do_compile.13267
for further information)

the commit# is a21ff559e7c93e9da61104f4a33e42e6004189fd</thetext>
  </long_desc><long_desc isprivate="0" >
    <commentid>15495</commentid>
    <comment_count>1</comment_count>
    <who name="Dongxiao Xu">dongxiao.xu</who>
    <bug_when>2011-08-16 20:08:54 +0000</bug_when>
    <thetext>This is a duplication of bug 1371. Please refer to that one.

Thanks,
Dongxiao

*** This bug has been marked as a duplicate of bug 1371 ***</thetext>
  </long_desc>
      
      

    </bug>

</bugzilla>