<?xml version="1.0" encoding="UTF-8" standalone="yes" ?>
<!DOCTYPE bugzilla SYSTEM "https://bugzilla.yoctoproject.org/page.cgi?id=bugzilla.dtd">

<bugzilla version="5.0.6"
          urlbase="https://bugzilla.yoctoproject.org/"
          
          maintainer="it-coreprojects-helpdesk@linuxfoundation.org"
>

    <bug>
          <bug_id>13788</bug_id>
          
          <creation_ts>2020-02-10 16:33:10 +0000</creation_ts>
          <short_desc>zeus-nut] selftest failure PackageTests.test_gdb_hardlink</short_desc>
          <delta_ts>2021-05-27 15:28:36 +0000</delta_ts>
          <reporter_accessible>1</reporter_accessible>
          <cclist_accessible>1</cclist_accessible>
          <classification_id>7</classification_id>
          <classification>Build System, Metadata &amp; Runtime</classification>
          <product>OE-Core</product>
          <component>core</component>
          <version>3.0.2</version>
          <rep_platform>x86</rep_platform>
          <op_sys>Multiple</op_sys>
          <bug_status>RESOLVED</bug_status>
          <resolution>WORKSFORME</resolution>
          
          
          <bug_file_loc>https://errors.yoctoproject.org/Errors/Build/98227/</bug_file_loc>
          <status_whiteboard></status_whiteboard>
          <keywords></keywords>
          <priority>Medium+</priority>
          <bug_severity>normal</bug_severity>
          <target_milestone>3.0.5</target_milestone>
          
          
          <everconfirmed>1</everconfirmed>
          <reporter name="akuster">akuster808</reporter>
          <assigned_to name="Randy MacLeod">randy.macleod</assigned_to>
          <cc>meta.mr.watcher</cc>
    
    <cc>meta.watcher</cc>
    
    <cc>randy.macleod</cc>
    
    <cc>richard.purdie</cc>
          
          
          <cf_os>---</cf_os>
          <cf_regression_type>Regression (Used to work)</cf_regression_type>
          
          <cf_docchange>Don&apos;t know</cf_docchange>

      

      

      

          <comment_sort_order>oldest_to_newest</comment_sort_order>  
          <long_desc isprivate="0" >
    <commentid>86390</commentid>
    <comment_count>0</comment_count>
    <who name="akuster">akuster808</who>
    <bug_when>2020-02-10 16:33:10 +0000</bug_when>
    <thetext>2020-02-09 04:30:51,871 - oe-selftest - INFO - FAIL: package.PackageTests.test_gdb_hardlink_debug (subunit.RemotedTestCase)
2020-02-09 04:30:51,871 - oe-selftest - INFO - ----------------------------------------------------------------------
2020-02-09 04:30:51,871 - oe-selftest - INFO - testtools.testresult.real._StringException: Traceback (most recent call last):
  File &quot;/home/pokybuild/yocto-worker/oe-selftest-fedora/build/meta/lib/oeqa/selftest/cases/package.py&quot;, line 150, in test_gdb_hardlink_debug
    self.fail(&apos;GDB %s failed&apos; % binary)
  File &quot;/usr/lib64/python3.7/unittest/case.py&quot;, line 693, in fail
    raise self.failureException(msg)
AssertionError: GDB /usr/bin/hello1 failed</thetext>
  </long_desc><long_desc isprivate="0" >
    <commentid>86391</commentid>
    <comment_count>1</comment_count>
    <who name="akuster">akuster808</who>
    <bug_when>2020-02-10 16:33:51 +0000</bug_when>
    <thetext>re-run selftest build and it passed.

Logging just to capture info</thetext>
  </long_desc><long_desc isprivate="0" >
    <commentid>86416</commentid>
    <comment_count>2</comment_count>
    <who name="Richard Purdie">richard.purdie</who>
    <bug_when>2020-02-13 15:20:19 +0000</bug_when>
    <thetext>Related to https://bugzilla.yoctoproject.org/show_bug.cgi?id=13123 ?</thetext>
  </long_desc><long_desc isprivate="0" >
    <commentid>89143</commentid>
    <comment_count>3</comment_count>
    <who name="Randy MacLeod">randy.macleod</who>
    <bug_when>2021-02-04 16:27:42 +0000</bug_when>
    <thetext>Randy fix this!!</thetext>
  </long_desc><long_desc isprivate="0" >
    <commentid>90513</commentid>
    <comment_count>4</comment_count>
    <who name="Randy MacLeod">randy.macleod</who>
    <bug_when>2021-05-27 15:28:36 +0000</bug_when>
    <thetext>Not seen in more than a year. Re-open if seen again and get Randy to fix it for real this time!</thetext>
  </long_desc>
      
      

    </bug>

</bugzilla>