<?xml version="1.0" encoding="UTF-8" standalone="yes" ?>
<!DOCTYPE bugzilla SYSTEM "https://bugzilla.yoctoproject.org/page.cgi?id=bugzilla.dtd">

<bugzilla version="5.0.6"
          urlbase="https://bugzilla.yoctoproject.org/"
          
          maintainer="it-coreprojects-helpdesk@linuxfoundation.org"
>

    <bug>
          <bug_id>13982</bug_id>
          
          <creation_ts>2020-07-16 02:15:05 +0000</creation_ts>
          <short_desc>recipe perf error for kernel5.6</short_desc>
          <delta_ts>2020-08-09 20:02:31 +0000</delta_ts>
          <reporter_accessible>1</reporter_accessible>
          <cclist_accessible>1</cclist_accessible>
          <classification_id>11</classification_id>
          <classification>Runtime</classification>
          <product>Installation</product>
          <component>Installation</component>
          <version>unspecified</version>
          <rep_platform>x86</rep_platform>
          <op_sys>Multiple</op_sys>
          <bug_status>RESOLVED</bug_status>
          <resolution>FIXED</resolution>
          
          
          <bug_file_loc></bug_file_loc>
          <status_whiteboard></status_whiteboard>
          <keywords></keywords>
          <priority>Medium</priority>
          <bug_severity>normal</bug_severity>
          <target_milestone>3.0.4</target_milestone>
          
          
          <everconfirmed>1</everconfirmed>
          <reporter name="shawn">shawn.hsiao</reporter>
          <assigned_to name="Anuj Mittal">anuj.mittal</assigned_to>
          <cc>kevin.tian</cc>
    
    <cc>randy.macleod</cc>
          
          
          <cf_os>---</cf_os>
          <cf_regression_type>---</cf_regression_type>
          
          <cf_docchange>Don&apos;t know</cf_docchange>

      

      

      

          <comment_sort_order>oldest_to_newest</comment_sort_order>  
          <long_desc isprivate="0" >
    <commentid>87766</commentid>
    <comment_count>0</comment_count>
    <who name="shawn">shawn.hsiao</who>
    <bug_when>2020-07-16 02:15:05 +0000</bug_when>
    <thetext>do_completed encounter error.

That is python3 version problem.
This cause of the problem is caused by python3.6
I upgrade to python3.8,that is solved.

But in that case, Yocto should be building it&apos;s own version of python

this error log:

NOTE: Setscene tasks completed
ERROR: perf-1.0-r9 do_compile: oe_runmake failed
ERROR: perf-1.0-r9 do_compile: Execution of &apos;/mnt/yocto/yocto_zeus_original/out/linux64/build/tmp/work/edison-poky-linux/perf/1.0-r9/temp/run.do_compile.14707&apos; failed with exit code 1:
make: Entering directory &apos;/mnt/yocto/yocto_zeus_original/out/linux64/build/tmp/work/edison-poky-linux/perf/1.0-r9/perf-1.0/tools/perf&apos;
  BUILD:   Doing &apos;make -j40&apos; parallel build

Auto-detecting system features:
...                         dwarf: [ on  ]
...            dwarf_getlocations: [ on  ]
...                         glibc: [ on  ]
...                          gtk2: [ OFF ]
...                      libaudit: [ OFF ]
...                        libbfd: [ on  ]
...                        libcap: [ OFF ]
...                        libelf: [ on  ]
...                       libnuma: [ OFF ]
...        numa_num_possible_cpus: [ OFF ]
...                       libperl: [ OFF ]
...                     libpython: [ on  ]
...                     libcrypto: [ on  ]
...                     libunwind: [ on  ]
...            libdw-dwarf-unwind: [ on  ]
...                          zlib: [ on  ]
...                          lzma: [ on  ]
...                     get_cpuid: [ on  ]
...                           bpf: [ on  ]
...                        libaio: [ on  ]
...                       libzstd: [ OFF ]
...        disassembler-four-args: [ on  ]

Makefile.config:506: DWARF support is off, BPF prologue is disabled
Makefile.config:714: Missing perl devel files. Disabling perl scripting support, please install perl-ExtUtils-Embed/libperl-dev
Makefile.config:843: No libzstd found, disables trace compression, please install libzstd-dev[el] and/or set LIBZSTD_DIR
Makefile.config:854: No libcap found, disables capability support, please install libcap-devel/libcap-dev
Makefile.config:922: No libbabeltrace found, disables &apos;perf data&apos; CTF format support, please install libbabeltrace-dev[el]/libbabeltrace-ctf-dev
  DESCEND  plugins
  GEN      /mnt/yocto/yocto_zeus_original/out/linux64/build/tmp/work/edison-poky-linux/perf/1.0-r9/perf-1.0/bpf_helper_defs.h
Failed to import the site module
Traceback (most recent call last):
  File &quot;/usr/lib/python3.6/site.py&quot;, line 570, in &lt;module&gt;
    main()
  File &quot;/usr/lib/python3.6/site.py&quot;, line 556, in main
    known_paths = addusersitepackages(known_paths)
  File &quot;/usr/lib/python3.6/site.py&quot;, line 288, in addusersitepackages
    user_site = getusersitepackages()
  File &quot;/usr/lib/python3.6/site.py&quot;, line 264, in getusersitepackages
    user_base = getuserbase() # this will also set USER_BASE
  File &quot;/usr/lib/python3.6/site.py&quot;, line 254, in getuserbase
    USER_BASE = get_config_var(&apos;userbase&apos;)
  File &quot;/usr/lib/python3.6/sysconfig.py&quot;, line 607, in get_config_var
    return get_config_vars().get(name)
  File &quot;/usr/lib/python3.6/sysconfig.py&quot;, line 550, in get_config_vars
    _init_posix(_CONFIG_VARS)
  File &quot;/usr/lib/python3.6/sysconfig.py&quot;, line 421, in _init_posix
    _temp = __import__(name, globals(), locals(), [&apos;build_time_vars&apos;], 0)
ModuleNotFoundError: No module named &apos;_sysconfigdata&apos;
Makefile:186: recipe for target &apos;/mnt/yocto/yocto_zeus_original/out/linux64/build/tmp/work/edison-poky-linux/perf/1.0-r9/perf-1.0/bpf_helper_defs.h&apos; failed
make[3]: *** [/mnt/yocto/yocto_zeus_original/out/linux64/build/tmp/work/edison-poky-linux/perf/1.0-r9/perf-1.0/bpf_helper_defs.h] Error 1
make[3]: *** Deleting file &apos;/mnt/yocto/yocto_zeus_original/out/linux64/build/tmp/work/edison-poky-linux/perf/1.0-r9/perf-1.0/bpf_helper_defs.h&apos;
Makefile.perf:778: recipe for target &apos;/mnt/yocto/yocto_zeus_original/out/linux64/build/tmp/work/edison-poky-linux/perf/1.0-r9/perf-1.0/libbpf.a&apos; failed
make[2]: *** [/mnt/yocto/yocto_zeus_original/out/linux64/build/tmp/work/edison-poky-linux/perf/1.0-r9/perf-1.0/libbpf.a] Error 2
make[2]: *** Waiting for unfinished jobs....
make[3]: Nothing to be done for &apos;/mnt/yocto/yocto_zeus_original/out/linux64/build/tmp/work/edison-poky-linux/perf/1.0-r9/perf-1.0/plugins/libtraceevent-dynamic-list&apos;.
Makefile:653: arch/x86/Makefile: No such file or directory
make[3]: *** No rule to make target &apos;arch/x86/Makefile&apos;.  Stop.
Makefile.perf:224: recipe for target &apos;sub-make&apos; failed
make[1]: *** [sub-make] Error 2
Makefile:69: recipe for target &apos;all&apos; failed
make: *** [all] Error 2
make: Leaving directory &apos;/mnt/yocto/yocto_zeus_original/out/linux64/build/tmp/work/edison-poky-linux/perf/1.0-r9/perf-1.0/tools/perf&apos;
WARNING: exit code 1 from a shell command.

ERROR: Logfile of failure stored in: /mnt/yocto/yocto_zeus_original/out/linux64/build/tmp/work/edison-poky-linux/perf/1.0-r9/temp/log.do_compile.14707
Log data follows:
| DEBUG: Executing shell function do_compile
| NOTE: make -j 40 -C /mnt/yocto/yocto_zeus_original/out/linux64/build/tmp/work/edison-poky-linux/perf/1.0-r9/perf-1.0/tools/perf O=/mnt/yocto/yocto_zeus_original/out/linux64/build/tmp/work/edison-poky-linux/perf/1.0-r9/perf-1.0 CROSS_COMPILE=x86_64-poky-linux- ARCH=x86 CC=x86_64-poky-linux-gcc  -m64 -march=nehalem -mtune=generic -mfpmath=sse -msse4.2 -mstackrealign -fstack-protector-strong  -D_FORTIFY_SOURCE=2 -Wformat -Wformat-security -Werror=format-security -O2 -pipe -g -feliminate-unused-debug-types -fmacro-prefix-map=/mnt/yocto/yocto_zeus_original/out/linux64/build/tmp/work/edison-poky-linux/perf/1.0-r9=/usr/src/debug/perf/1.0-r9                      -fdebug-prefix-map=/mnt/yocto/yocto_zeus_original/out/linux64/build/tmp/work/edison-poky-linux/perf/1.0-r9=/usr/src/debug/perf/1.0-r9                      -fdebug-prefix-map=/mnt/yocto/yocto_zeus_original/out/linux64/build/tmp/work/edison-poky-linux/perf/1.0-r9/recipe-sysroot=                      -fdebug-prefix-map=/mnt/yocto/yocto_zeus_original/out/linux64/build/tmp/work/edison-poky-linux/perf/1.0-r9/recipe-sysroot-native=  --sysroot=/mnt/yocto/yocto_zeus_original/out/linux64/build/tmp/work/edison-poky-linux/perf/1.0-r9/recipe-sysroot AR=x86_64-poky-linux-gcc-ar LD=x86_64-poky-linux-ld --sysroot=/mnt/yocto/yocto_zeus_original/out/linux64/build/tmp/work/edison-poky-linux/perf/1.0-r9/recipe-sysroot   EXTRA_CFLAGS=-ldw EXTRA_LDFLAGS= perfexecdir=/usr/libexec NO_GTK2=1 NO_DEMANGLE=1 NO_LIBAUDIT=1 NO_DWARF=1 NO_JVMTI=1 NO_LIBNUMA=1 NO_SDT=1 TMPDIR=/mnt/yocto/yocto_zeus_original/out/linux64/build/tmp/work/edison-poky-linux/perf/1.0-r9/perf-1.0 LIBUNWIND_DIR=/mnt/yocto/yocto_zeus_original/out/linux64/build/tmp/work/edison-poky-linux/perf/1.0-r9/recipe-sysroot/usr DESTDIR=/mnt/yocto/yocto_zeus_original/out/linux64/build/tmp/work/edison-poky-linux/perf/1.0-r9/image prefix=/usr bindir=/usr/bin sharedir=/usr/share sysconfdir=/etc perfexecdir=/usr/libexec/perf-core ETC_PERFCONFIG=../etc sharedir=share mandir=share/man infodir=share/info PYTHON=python3 PYTHON_CONFIG=python3-config all
| make: Entering directory &apos;/mnt/yocto/yocto_zeus_original/out/linux64/build/tmp/work/edison-poky-linux/perf/1.0-r9/perf-1.0/tools/perf&apos;
|   BUILD:   Doing &apos;make -j40&apos; parallel build
|
| Auto-detecting system features:
| ...                         dwarf: [ on  ]
| ...            dwarf_getlocations: [ on  ]
| ...                         glibc: [ on  ]
| ...                          gtk2: [ OFF ]
| ...                      libaudit: [ OFF ]
| ...                        libbfd: [ on  ]
| ...                        libcap: [ OFF ]
| ...                        libelf: [ on  ]
| ...                       libnuma: [ OFF ]
| ...        numa_num_possible_cpus: [ OFF ]
| ...                       libperl: [ OFF ]
| ...                     libpython: [ on  ]
| ...                     libcrypto: [ on  ]
| ...                     libunwind: [ on  ]
| ...            libdw-dwarf-unwind: [ on  ]
| ...                          zlib: [ on  ]
| ...                          lzma: [ on  ]
| ...                     get_cpuid: [ on  ]
| ...                           bpf: [ on  ]
| ...                        libaio: [ on  ]
| ...                       libzstd: [ OFF ]
| ...        disassembler-four-args: [ on  ]
|
| Makefile.config:506: DWARF support is off, BPF prologue is disabled
| Makefile.config:714: Missing perl devel files. Disabling perl scripting support, please install perl-ExtUtils-Embed/libperl-dev
| Makefile.config:843: No libzstd found, disables trace compression, please install libzstd-dev[el] and/or set LIBZSTD_DIR
| Makefile.config:854: No libcap found, disables capability support, please install libcap-devel/libcap-dev
| Makefile.config:922: No libbabeltrace found, disables &apos;perf data&apos; CTF format support, please install libbabeltrace-dev[el]/libbabeltrace-ctf-dev
|   DESCEND  plugins
|   GEN      /mnt/yocto/yocto_zeus_original/out/linux64/build/tmp/work/edison-poky-linux/perf/1.0-r9/perf-1.0/bpf_helper_defs.h
| Failed to import the site module
| Traceback (most recent call last):
|   File &quot;/usr/lib/python3.6/site.py&quot;, line 570, in &lt;module&gt;
|     main()
|   File &quot;/usr/lib/python3.6/site.py&quot;, line 556, in main
|     known_paths = addusersitepackages(known_paths)
|   File &quot;/usr/lib/python3.6/site.py&quot;, line 288, in addusersitepackages
|     user_site = getusersitepackages()
|   File &quot;/usr/lib/python3.6/site.py&quot;, line 264, in getusersitepackages
|     user_base = getuserbase() # this will also set USER_BASE
|   File &quot;/usr/lib/python3.6/site.py&quot;, line 254, in getuserbase
|     USER_BASE = get_config_var(&apos;userbase&apos;)
|   File &quot;/usr/lib/python3.6/sysconfig.py&quot;, line 607, in get_config_var
|     return get_config_vars().get(name)
|   File &quot;/usr/lib/python3.6/sysconfig.py&quot;, line 550, in get_config_vars
|     _init_posix(_CONFIG_VARS)
|   File &quot;/usr/lib/python3.6/sysconfig.py&quot;, line 421, in _init_posix
|     _temp = __import__(name, globals(), locals(), [&apos;build_time_vars&apos;], 0)
| ModuleNotFoundError: No module named &apos;_sysconfigdata&apos;
| Makefile:186: recipe for target &apos;/mnt/yocto/yocto_zeus_original/out/linux64/build/tmp/work/edison-poky-linux/perf/1.0-r9/perf-1.0/bpf_helper_defs.h&apos; failed
| make[3]: *** [/mnt/yocto/yocto_zeus_original/out/linux64/build/tmp/work/edison-poky-linux/perf/1.0-r9/perf-1.0/bpf_helper_defs.h] Error 1
| make[3]: *** Deleting file &apos;/mnt/yocto/yocto_zeus_original/out/linux64/build/tmp/work/edison-poky-linux/perf/1.0-r9/perf-1.0/bpf_helper_defs.h&apos;
| Makefile.perf:778: recipe for target &apos;/mnt/yocto/yocto_zeus_original/out/linux64/build/tmp/work/edison-poky-linux/perf/1.0-r9/perf-1.0/libbpf.a&apos; failed
| make[2]: *** [/mnt/yocto/yocto_zeus_original/out/linux64/build/tmp/work/edison-poky-linux/perf/1.0-r9/perf-1.0/libbpf.a] Error 2
| make[2]: *** Waiting for unfinished jobs....
| make[3]: Nothing to be done for &apos;/mnt/yocto/yocto_zeus_original/out/linux64/build/tmp/work/edison-poky-linux/perf/1.0-r9/perf-1.0/plugins/libtraceevent-dynamic-list&apos;.
| Makefile:653: arch/x86/Makefile: No such file or directory
| make[3]: *** No rule to make target &apos;arch/x86/Makefile&apos;.  Stop.
| ERROR: oe_runmake failed
| Makefile.perf:224: recipe for target &apos;sub-make&apos; failed
| make[1]: *** [sub-make] Error 2
| Makefile:69: recipe for target &apos;all&apos; failed
| make: *** [all] Error 2
| make: Leaving directory &apos;/mnt/yocto/yocto_zeus_original/out/linux64/build/tmp/work/edison-poky-linux/perf/1.0-r9/perf-1.0/tools/perf&apos;
| WARNING: exit code 1 from a shell command.
| ERROR: Execution of &apos;/mnt/yocto/yocto_zeus_original/out/linux64/build/tmp/work/edison-poky-linux/perf/1.0-r9/temp/run.do_compile.14707&apos; failed with exit code 1:
| make: Entering directory &apos;/mnt/yocto/yocto_zeus_original/out/linux64/build/tmp/work/edison-poky-linux/perf/1.0-r9/perf-1.0/tools/perf&apos;
|   BUILD:   Doing &apos;make -j40&apos; parallel build
|
| Auto-detecting system features:
| ...                         dwarf: [ on  ]
| ...            dwarf_getlocations: [ on  ]
| ...                         glibc: [ on  ]
| ...                          gtk2: [ OFF ]
| ...                      libaudit: [ OFF ]
| ...                        libbfd: [ on  ]
| ...                        libcap: [ OFF ]
| ...                        libelf: [ on  ]
| ...                       libnuma: [ OFF ]
| ...        numa_num_possible_cpus: [ OFF ]
| ...                       libperl: [ OFF ]
| ...                     libpython: [ on  ]
| ...                     libcrypto: [ on  ]
| ...                     libunwind: [ on  ]
| ...            libdw-dwarf-unwind: [ on  ]
| ...                          zlib: [ on  ]
| ...                          lzma: [ on  ]
| ...                     get_cpuid: [ on  ]
| ...                           bpf: [ on  ]
| ...                        libaio: [ on  ]
| ...                       libzstd: [ OFF ]
| ...        disassembler-four-args: [ on  ]
|
| Makefile.config:506: DWARF support is off, BPF prologue is disabled
| Makefile.config:714: Missing perl devel files. Disabling perl scripting support, please install perl-ExtUtils-Embed/libperl-dev
| Makefile.config:843: No libzstd found, disables trace compression, please install libzstd-dev[el] and/or set LIBZSTD_DIR
| Makefile.config:854: No libcap found, disables capability support, please install libcap-devel/libcap-dev
| Makefile.config:922: No libbabeltrace found, disables &apos;perf data&apos; CTF format support, please install libbabeltrace-dev[el]/libbabeltrace-ctf-dev
|   DESCEND  plugins
|   GEN      /mnt/yocto/yocto_zeus_original/out/linux64/build/tmp/work/edison-poky-linux/perf/1.0-r9/perf-1.0/bpf_helper_defs.h
| Failed to import the site module
| Traceback (most recent call last):
|   File &quot;/usr/lib/python3.6/site.py&quot;, line 570, in &lt;module&gt;
|     main()
|   File &quot;/usr/lib/python3.6/site.py&quot;, line 556, in main
|     known_paths = addusersitepackages(known_paths)
|   File &quot;/usr/lib/python3.6/site.py&quot;, line 288, in addusersitepackages
|     user_site = getusersitepackages()
|   File &quot;/usr/lib/python3.6/site.py&quot;, line 264, in getusersitepackages
|     user_base = getuserbase() # this will also set USER_BASE
|   File &quot;/usr/lib/python3.6/site.py&quot;, line 254, in getuserbase
|     USER_BASE = get_config_var(&apos;userbase&apos;)
|   File &quot;/usr/lib/python3.6/sysconfig.py&quot;, line 607, in get_config_var
|     return get_config_vars().get(name)
|   File &quot;/usr/lib/python3.6/sysconfig.py&quot;, line 550, in get_config_vars
|     _init_posix(_CONFIG_VARS)
|   File &quot;/usr/lib/python3.6/sysconfig.py&quot;, line 421, in _init_posix
|     _temp = __import__(name, globals(), locals(), [&apos;build_time_vars&apos;], 0)
| ModuleNotFoundError: No module named &apos;_sysconfigdata&apos;
| Makefile:186: recipe for target &apos;/mnt/yocto/yocto_zeus_original/out/linux64/build/tmp/work/edison-poky-linux/perf/1.0-r9/perf-1.0/bpf_helper_defs.h&apos; failed
| make[3]: *** [/mnt/yocto/yocto_zeus_original/out/linux64/build/tmp/work/edison-poky-linux/perf/1.0-r9/perf-1.0/bpf_helper_defs.h] Error 1
| make[3]: *** Deleting file &apos;/mnt/yocto/yocto_zeus_original/out/linux64/build/tmp/work/edison-poky-linux/perf/1.0-r9/perf-1.0/bpf_helper_defs.h&apos;
| Makefile.perf:778: recipe for target &apos;/mnt/yocto/yocto_zeus_original/out/linux64/build/tmp/work/edison-poky-linux/perf/1.0-r9/perf-1.0/libbpf.a&apos; failed
| make[2]: *** [/mnt/yocto/yocto_zeus_original/out/linux64/build/tmp/work/edison-poky-linux/perf/1.0-r9/perf-1.0/libbpf.a] Error 2
| make[2]: *** Waiting for unfinished jobs....
| make[3]: Nothing to be done for &apos;/mnt/yocto/yocto_zeus_original/out/linux64/build/tmp/work/edison-poky-linux/perf/1.0-r9/perf-1.0/plugins/libtraceevent-dynamic-list&apos;.
| Makefile:653: arch/x86/Makefile: No such file or directory
| make[3]: *** No rule to make target &apos;arch/x86/Makefile&apos;.  Stop.
| Makefile.perf:224: recipe for target &apos;sub-make&apos; failed
| make[1]: *** [sub-make] Error 2
| Makefile:69: recipe for target &apos;all&apos; failed
| make: *** [all] Error 2
| make: Leaving directory &apos;/mnt/yocto/yocto_zeus_original/out/linux64/build/tmp/work/edison-poky-linux/perf/1.0-r9/perf-1.0/tools/perf&apos;
| WARNING: exit code 1 from a shell command.
|
ERROR: Task (/mnt/yocto/yocto_zeus_original/meta-intel-edison/meta-intel-edison-bsp/recipes-kernel/perf/perf.bb:do_compile) failed with exit code &apos;1&apos;
NOTE: Tasks Summary: Attempted 5620 tasks of which 5571 didn&apos;t need to be rerun and 1 failed.
NOTE: Writing buildhistory
NOTE: Writing buildhistory took: 3 seconds

Summary: 1 task failed:
  /mnt/yocto/yocto_zeus_original/meta-intel-edison/meta-intel-edison-bsp/recipes-kernel/perf/perf.bb:do_compile
Summary: There were 2 ERROR messages shown, returning a non-zero exit code.
Makefile:53: recipe for target &apos;edison-image&apos; failed
make: *** [edison-image] Error 1</thetext>
  </long_desc><long_desc isprivate="0" >
    <commentid>87780</commentid>
    <comment_count>1</comment_count>
    <who name="Anuj Mittal">anuj.mittal</who>
    <bug_when>2020-07-16 18:09:44 +0000</bug_when>
    <thetext>Can you please locally apply and test:

https://git.yoctoproject.org/cgit/cgit.cgi/poky/commit/?id=e5c4f3127521607742f7cdf62481b64cf4d3e828

https://git.yoctoproject.org/cgit/cgit.cgi/poky/commit/?id=3a1a18ba9d28adb5562eabe9ec354f6d93154f5c

It&apos;s probably not related to the version as we use native version already. I assume that you did a clean before building with upgraded python?</thetext>
  </long_desc><long_desc isprivate="0" >
    <commentid>87781</commentid>
    <comment_count>2</comment_count>
    <who name="shawn">shawn.hsiao</who>
    <bug_when>2020-07-16 19:01:58 +0000</bug_when>
    <thetext>(In reply to comment #1)
&gt; Can you please locally apply and test:
&gt; 
&gt; https://git.yoctoproject.org/cgit/cgit.cgi/poky/commit/
&gt; ?id=e5c4f3127521607742f7cdf62481b64cf4d3e828
&gt; 
&gt; https://git.yoctoproject.org/cgit/cgit.cgi/poky/commit/
&gt; ?id=3a1a18ba9d28adb5562eabe9ec354f6d93154f5c
&gt; 


I tested https://git.yoctoproject.org/cgit/cgit.cgi/poky/commit/?id=3a1a18ba9d28adb5562eabe9ec354f6d93154f5c that solved issue before upgrade python.

but I same solved issue after upgrade python.

&gt; It&apos;s probably not related to the version as we use native version already. I
&gt; assume that you did a clean before building with upgraded python?

No,I didn&apos;t clean before building with upgraded python</thetext>
  </long_desc><long_desc isprivate="0" >
    <commentid>87902</commentid>
    <comment_count>3</comment_count>
    <who name="Anuj Mittal">anuj.mittal</who>
    <bug_when>2020-08-09 20:02:31 +0000</bug_when>
    <thetext>This has been merged in zeus. Please let me know if you still see issues.</thetext>
  </long_desc>
      
      

    </bug>

</bugzilla>