<?xml version="1.0" encoding="UTF-8" standalone="yes" ?>
<!DOCTYPE bugzilla SYSTEM "https://bugzilla.yoctoproject.org/page.cgi?id=bugzilla.dtd">

<bugzilla version="5.0.6"
          urlbase="https://bugzilla.yoctoproject.org/"
          
          maintainer="it-coreprojects-helpdesk@linuxfoundation.org"
>

    <bug>
          <bug_id>14004</bug_id>
          
          <creation_ts>2020-08-12 02:47:39 +0000</creation_ts>
          <short_desc>cross-localedef-native build race failure</short_desc>
          <delta_ts>2020-08-20 08:02:45 +0000</delta_ts>
          <reporter_accessible>1</reporter_accessible>
          <cclist_accessible>1</cclist_accessible>
          <classification_id>7</classification_id>
          <classification>Build System, Metadata &amp; Runtime</classification>
          <product>OE-Core</product>
          <component>core</component>
          <version>3.2</version>
          <rep_platform>x86</rep_platform>
          <op_sys>Multiple</op_sys>
          <bug_status>RESOLVED</bug_status>
          <resolution>FIXED</resolution>
          
          
          <bug_file_loc></bug_file_loc>
          <status_whiteboard>AB-INT</status_whiteboard>
          <keywords></keywords>
          <priority>Medium+</priority>
          <bug_severity>normal</bug_severity>
          <target_milestone>3.2 M3</target_milestone>
          
          
          <everconfirmed>1</everconfirmed>
          <reporter name="Richard Purdie">richard.purdie</reporter>
          <assigned_to name="akuster">akuster808</assigned_to>
          <cc>akuster808</cc>
    
    <cc>alex.kanavin</cc>
    
    <cc>denis</cc>
    
    <cc>meta.mr.watcher</cc>
    
    <cc>meta.watcher</cc>
    
    <cc>philip</cc>
    
    <cc>randy.macleod</cc>
          
          
          <cf_os>---</cf_os>
          <cf_regression_type>---</cf_regression_type>
          
          <cf_docchange>No (bug/feature does not impact docs)</cf_docchange>

      

      

      

          <comment_sort_order>oldest_to_newest</comment_sort_order>  
          <long_desc isprivate="0" >
    <commentid>87914</commentid>
    <comment_count>0</comment_count>
    <who name="Richard Purdie">richard.purdie</who>
    <bug_when>2020-08-12 02:47:39 +0000</bug_when>
    <thetext>https://autobuilder.yoctoproject.org/typhoon/#/builders/56/builds/1151

debian9-ty-2

 gcc  -isystem/home/pokybuild/yocto-worker/oe-selftest/build/build-st-57136/reproducibleB/tmp/work/x86_64-linux/cross-localedef-native/2.32-r0/recipe-sysroot-native/usr/include -isystem/home/pokybuild/yocto-worker/oe-selftest/build/build-st-57136/reproducibleB/tmp/work/x86_64-linux/cross-localedef-native/2.32-r0/recipe-sysroot-native/usr/include -O2 -pipe -fgnu89-inline -std=gnu99 -DIS_IN\(x\)=&apos;0&apos; -DNO_SYSCONF -DNO_UNCOMPRESS -DLOCALE_PATH=&apos;&quot;/home/pokybuild/yocto-worker/oe-selftest/build/build-st-57136/reproducibleB/tmp/work/x86_64-linux/cross-localedef-native/2.32-r0/recipe-sysroot-native/usr/lib/locale:/home/pokybuild/yocto-worker/oe-selftest/build/build-st-57136/reproducibleB/tmp/work/x86_64-linux/cross-localedef-native/2.32-r0/recipe-sysroot-native/usr/share/i18n&quot;&apos; -DLOCALEDIR=&apos;&quot;/home/pokybuild/yocto-worker/oe-selftest/build/build-st-57136/reproducibleB/tmp/work/x86_64-linux/cross-localedef-native/2.32-r0/recipe-sysroot-native/usr/lib/locale&quot;&apos; -DCOMPLOCALEDIR=&apos;&quot;/home/pokybuild/yocto-worker/oe-selftest/build/build-st-57136/reproducibleB/tmp/work/x86_64-linux/cross-localedef-native/2.32-r0/recipe-sysroot-native/usr/lib/locale&quot;&apos; -DLOCALE_ALIAS_PATH=&apos;&quot;/home/pokybuild/yocto-worker/oe-selftest/build/build-st-57136/reproducibleB/tmp/work/x86_64-linux/cross-localedef-native/2.32-r0/recipe-sysroot-native/usr/share/locale&quot;&apos; -DCHARMAP_PATH=&apos;&quot;/home/pokybuild/yocto-worker/oe-selftest/build/build-st-57136/reproducibleB/tmp/work/x86_64-linux/cross-localedef-native/2.32-r0/recipe-sysroot-native/usr/share/i18n/charmaps&quot;&apos; -DREPERTOIREMAP_PATH=&apos;&quot;/home/pokybuild/yocto-worker/oe-selftest/build/build-st-57136/reproducibleB/tmp/work/x86_64-linux/cross-localedef-native/2.32-r0/recipe-sysroot-native/usr/share/i18n/repertoiremaps&quot;&apos; -DLOCSRCDIR=&apos;&quot;/home/pokybuild/yocto-worker/oe-selftest/build/build-st-57136/reproducibleB/tmp/work/x86_64-linux/cross-localedef-native/2.32-r0/recipe-sysroot-native/usr/share/i18n/locales&quot;&apos; -DNOT_IN_libc -DIN_GLIBC_LOCALEDEF -Iglibc/locale/programs -I../git/localedef/include -Iglibc/locale -I../git/localedef -I. -include ../git/localedef/include/always.h -Wall -Wno-format -c -o localedef.o glibc/locale/programs/localedef.c
| In file included from ../git/localedef/include/error.h:1:0,
|                  from glibc/locale/programs/linereader.h:27,
|                  from glibc/locale/programs/locfile.h:27,
|                  from glibc/locale/programs/ld-paper.c:31:
| ./glibc/misc/error.h:50:25: fatal error: bits/floatn.h: No such file or directory
|  #include &lt;bits/floatn.h&gt;
|                          ^
| In file included from ../git/localedef/include/error.h:1:0,
|                  from glibc/locale/programs/linereader.h:27,
|                  from glibc/locale/programs/ld-monetary.c:33:
| ./glibc/misc/error.h:50:25: fatal error: bits/floatn.h: No such file or directory
|  #include &lt;bits/floatn.h&gt;
|                          ^
| In file included from ../git/localedef/include/error.h:1:0,
|                  from glibc/locale/programs/linereader.h:27,
|                  from glibc/locale/programs/ld-collate.c:31:
| ./glibc/misc/error.h:50:25: fatal error: bits/floatn.h: No such file or directory
|  #include &lt;bits/floatn.h&gt;
|                          ^
| In file included from ../git/localedef/include/error.h:1:0,
|                  from glibc/locale/programs/linereader.h:27,
|                  from glibc/locale/programs/locfile.h:27,
|                  from glibc/locale/programs/ld-address.c:32:
| ./glibc/misc/error.h:50:25: fatal error: bits/floatn.h: No such file or directory
|  #include &lt;bits/floatn.h&gt;
|                          ^
| compilation terminated.
| compilation terminated.
| compilation terminated.
| compilation terminated.
| In file included from ../git/localedef/include/argp.h:1:0,
|                  from glibc/locale/programs/localedef.c:22:
| ./glibc/argp/argp.h:557:25: fatal error: bits/floatn.h: No such file or directory
|  #include &lt;bits/floatn.h&gt;
|                          ^
| compilation terminated.
| In file included from ../git/localedef/include/error.h:1:0,
|                  from glibc/locale/programs/linereader.h:27,
|                  from glibc/locale/programs/locfile.h:27,
|                  from glibc/locale/programs/ld-identification.c:32:
| ./glibc/misc/error.h:50:25: fatal error: bits/floatn.h: No such file or directory
|  #include &lt;bits/floatn.h&gt;
|                          ^
| compilation terminated.
| In file included from ../git/localedef/include/error.h:1:0,
|                  from glibc/locale/programs/linereader.c:33:
| ./glibc/misc/error.h:50:25: fatal error: bits/floatn.h: No such file or directory
|  #include &lt;bits/floatn.h&gt;
|                          ^
| compilation terminated.
| In file included from ../git/localedef/include/error.h:1:0,
|                  from glibc/locale/programs/linereader.h:27,
|                  from glibc/locale/programs/locfile.h:27,
|                  from glibc/locale/programs/ld-name.c:31:
| ./glibc/misc/error.h:50:25: fatal error: bits/floatn.h: No such file or directory
|  #include &lt;bits/floatn.h&gt;
|                          ^
| compilation terminated.
| In file included from ../git/localedef/include/error.h:1:0,
|                  from glibc/locale/programs/linereader.h:27,
|                  from glibc/locale/programs/locfile.h:27,
|                  from glibc/locale/programs/ld-measurement.c:31:
| ./glibc/misc/error.h:50:25: fatal error: bits/floatn.h: No such file or directory
|  #include &lt;bits/floatn.h&gt;
|                          ^
| compilation terminated.
| In file included from ../git/localedef/include/error.h:1:0,
|                  from glibc/locale/programs/linereader.h:27,
|                  from glibc/locale/programs/charmap.c:32:
| ./glibc/misc/error.h:50:25: fatal error: bits/floatn.h: No such file or directory
|  #include &lt;bits/floatn.h&gt;
|                          ^
| In file included from ../git/localedef/include/error.h:1:0,
|                  from glibc/locale/programs/linereader.h:27,
|                  from glibc/locale/programs/locfile.h:27,
|                  from glibc/locale/programs/ld-telephone.c:31:
| ./glibc/misc/error.h:50:25: fatal error: bits/floatn.h: No such file or directory
|  #include &lt;bits/floatn.h&gt;
|                          ^
| compilation terminated.
| compilation terminated.
| In file included from ../git/localedef/include/error.h:1:0,
|                  from glibc/locale/programs/linereader.h:27,
|                  from glibc/locale/programs/ld-messages.c:32:
| ./glibc/misc/error.h:50:25: fatal error: bits/floatn.h: No such file or directory
|  #include &lt;bits/floatn.h&gt;
|                          ^
| compilation terminated.
| In file included from ../git/localedef/include/error.h:1:0,
|                  from glibc/locale/programs/linereader.h:27,
|                  from glibc/locale/programs/ld-numeric.c:30:
| ./glibc/misc/error.h:50:25: fatal error: bits/floatn.h: No such file or directory
|  #include &lt;bits/floatn.h&gt;
|                          ^
| In file included from ../git/localedef/include/error.h:1:0,
|                  from glibc/locale/programs/linereader.h:27,
|                  from glibc/locale/programs/ld-time.c:33:
| ./glibc/misc/error.h:50:25: fatal error: bits/floatn.h: No such file or directory
|  #include &lt;bits/floatn.h&gt;
|                          ^
| compilation terminated.
| compilation terminated.
| In file included from ../git/localedef/include/error.h:1:0,
|                  from glibc/locale/programs/linereader.h:27,
|                  from glibc/locale/programs/ld-ctype.c:39:
| ./glibc/misc/error.h:50:25: fatal error: bits/floatn.h: No such file or directory
|  #include &lt;bits/floatn.h&gt;
|                          ^
| compilation terminated.
| Makefile:72: recipe for target &apos;ld-collate.o&apos; failed
| make: *** [ld-collate.o] Error 1
| make: *** Waiting for unfinished jobs....
| Makefile:72: recipe for target &apos;ld-identification.o&apos; failed
| make: *** [ld-identification.o] Error 1
| Makefile:72: recipe for target &apos;ld-messages.o&apos; failed
| make: *** [ld-messages.o] Error 1
| Makefile:72: recipe for target &apos;ld-monetary.o&apos; failed
| make: *** [ld-monetary.o] Error 1
| Makefile:72: recipe for target &apos;ld-name.o&apos; failed
| make: *** [ld-name.o] Error 1
| Makefile:72: recipe for target &apos;ld-paper.o&apos; failed
| make: *** [ld-paper.o] Error 1
| Makefile:72: recipe for target &apos;ld-time.o&apos; failed
| make: *** [ld-time.o] Error 1
| Makefile:72: recipe for target &apos;linereader.o&apos; failed
| make: *** [linereader.o] Error 1
| Makefile:72: recipe for target &apos;ld-address.o&apos; failed
| make: *** [ld-address.o] Error 1
| Makefile:72: recipe for target &apos;ld-ctype.o&apos; failed
| make: *** [ld-ctype.o] Error 1
| Makefile:72: recipe for target &apos;ld-numeric.o&apos; failed
| make: *** [ld-numeric.o] Error 1
| Makefile:72: recipe for target &apos;localedef.o&apos; failed
| make: *** [localedef.o] Error 1
| Makefile:72: recipe for target &apos;ld-measurement.o&apos; failed
| make: *** [ld-measurement.o] Error 1
| Makefile:72: recipe for target &apos;charmap.o&apos; failed
| make: *** [charmap.o] Error 1
| Makefile:72: recipe for target &apos;ld-telephone.o&apos; failed
| make: *** [ld-telephone.o] Error 1
| WARNING: exit code 1 from a shell command.
| 
NOTE: recipe cross-localedef-native-2.32-r0: task do_compile: Failed
ERROR: Task (/home/pokybuild/yocto-worker/oe-selftest/build/meta/recipes-core/glibc/cross-localedef-native_2.32.bb:do_compile) failed with exit code &apos;1&apos;</thetext>
  </long_desc><long_desc isprivate="0" >
    <commentid>87924</commentid>
    <comment_count>1</comment_count>
    <who name="akuster">akuster808</who>
    <bug_when>2020-08-13 07:15:50 +0000</bug_when>
    <thetext>I saw this when trying to reproduce the mips testimage issue in another bug.</thetext>
  </long_desc><long_desc isprivate="0" >
    <commentid>87958</commentid>
    <comment_count>2</comment_count>
    <who name="Denys Dmytriyenko">denis</who>
    <bug_when>2020-08-16 13:45:08 +0000</bug_when>
    <thetext>100% reproducible for me on Ubuntu 16.04.7 LTS with upgraded host gcc 8.4 from ppa:ubuntu-toolchain-r - own distro, poky or nodistro, uninative doesn&apos;t help</thetext>
  </long_desc><long_desc isprivate="0" >
    <commentid>87959</commentid>
    <comment_count>3</comment_count>
    <who name="Phlip Balister">philip</who>
    <bug_when>2020-08-16 14:30:58 +0000</bug_when>
    <thetext>I&apos;m seeing this on a F26 box (yeah I know). Fixed with:

touch ./tmp-glibc/work/x86_64-linux/cross-localedef-native/2.32-r0/git/localedef/include/bits/floatn.h


Per Khem. Yeah I know this isn&apos;t likely a real fix.</thetext>
  </long_desc><long_desc isprivate="0" >
    <commentid>87963</commentid>
    <comment_count>4</comment_count>
    <who name="Richard Purdie">richard.purdie</who>
    <bug_when>2020-08-17 01:01:32 +0000</bug_when>
    <thetext>https://autobuilder.yoctoproject.org/typhoon/#/builders/80/builds/1240 debina9-ty-2</thetext>
  </long_desc><long_desc isprivate="0" >
    <commentid>87972</commentid>
    <comment_count>5</comment_count>
    <who name="Alexander Kanavin">alex.kanavin</who>
    <bug_when>2020-08-18 08:58:43 +0000</bug_when>
    <thetext>https://autobuilder.yoctoproject.org/typhoon/#/builders/80/builds/1246/steps/8/logs/step2d

debian 9 as well</thetext>
  </long_desc><long_desc isprivate="0" >
    <commentid>87996</commentid>
    <comment_count>6</comment_count>
    <who name="Richard Purdie">richard.purdie</who>
    <bug_when>2020-08-20 08:02:45 +0000</bug_when>
    <thetext>http://git.yoctoproject.org/cgit.cgi/poky/commit/?id=a8558cbf7d60bb711d8276b7c4e77e8837c66f59</thetext>
  </long_desc>
      
      

    </bug>

</bugzilla>