<?xml version="1.0" encoding="UTF-8" standalone="yes" ?>
<!DOCTYPE bugzilla SYSTEM "https://bugzilla.yoctoproject.org/page.cgi?id=bugzilla.dtd">

<bugzilla version="5.0.6"
          urlbase="https://bugzilla.yoctoproject.org/"
          
          maintainer="it-coreprojects-helpdesk@linuxfoundation.org"
>

    <bug>
          <bug_id>14029</bug_id>
          
          <creation_ts>2020-08-27 23:16:46 +0000</creation_ts>
          <short_desc>qemu image failed ping test</short_desc>
          <delta_ts>2022-04-14 15:14:21 +0000</delta_ts>
          <reporter_accessible>1</reporter_accessible>
          <cclist_accessible>1</cclist_accessible>
          <classification_id>10</classification_id>
          <classification>QA/Testing</classification>
          <product>Runtime Testing</product>
          <component>testimage</component>
          <version>unspecified</version>
          <rep_platform>x86</rep_platform>
          <op_sys>Multiple</op_sys>
          <bug_status>RESOLVED</bug_status>
          <resolution>FIXED</resolution>
          
          
          <bug_file_loc></bug_file_loc>
          <status_whiteboard>AB-INT AB-INT-NET</status_whiteboard>
          <keywords></keywords>
          <priority>Medium</priority>
          <bug_severity>normal</bug_severity>
          <target_milestone>4.1</target_milestone>
          
          
          <everconfirmed>1</everconfirmed>
          <reporter name="Richard Purdie">richard.purdie</reporter>
          <assigned_to name="Unassigned">unassigned</assigned_to>
          <cc>alejandro</cc>
    
    <cc>alexandre.belloni</cc>
    
    <cc>anuj.mittal</cc>
    
    <cc>bluelightning</cc>
    
    <cc>chee.yang.lee</cc>
    
    <cc>flowergom</cc>
    
    <cc>Jagadheesan_Duraisamy</cc>
    
    <cc>oobitots</cc>
    
    <cc>randy.macleod</cc>
    
    <cc>steve</cc>
          
          
          <cf_os>---</cf_os>
          <cf_regression_type>---</cf_regression_type>
          
          <cf_docchange>No (bug/feature does not impact docs)</cf_docchange>

      

      

      

          <comment_sort_order>oldest_to_newest</comment_sort_order>  
          <long_desc isprivate="0" >
    <commentid>88056</commentid>
    <comment_count>0</comment_count>
    <who name="Richard Purdie">richard.purdie</who>
    <bug_when>2020-08-27 23:16:46 +0000</bug_when>
    <thetext>https://autobuilder.yoctoproject.org/typhoon/#/builders/53/builds/2384 fedora32-ty-1 core-image-sato

Ping test failed, therefore nothing else ran.

Traceback (most recent call last):
  File &quot;/home/pokybuild/yocto-worker/qemuarm/build/meta/lib/oeqa/core/decorator/__init__.py&quot;, line 36, in wrapped_f
    return func(*args, **kwargs)
  File &quot;/home/pokybuild/yocto-worker/qemuarm/build/meta/lib/oeqa/runtime/cases/ping.py&quot;, line 19, in test_ping
    output += proc.communicate()[0].decode(&apos;utf-8&apos;)
  File &quot;/usr/lib64/python3.8/subprocess.py&quot;, line 1011, in communicate
    stdout = self.stdout.read()
  File &quot;/home/pokybuild/yocto-worker/qemuarm/build/meta/lib/oeqa/core/decorator/oetimeout.py&quot;, line 18, in _timeoutHandler
    raise OEQATimeoutError(&quot;Timed out after %s &quot;
oeqa.core.exception.OEQATimeoutError: Timed out after 30 seconds of execution

Test case ssh.SSHTest.test_ssh depends on ping.PingTest.test_ping but it didn&apos;t pass/run.</thetext>
  </long_desc><long_desc isprivate="0" >
    <commentid>88128</commentid>
    <comment_count>1</comment_count>
    <who name="Randy MacLeod">randy.macleod</who>
    <bug_when>2020-09-10 07:45:09 +0000</bug_when>
    <thetext>We think that with the new &apos;nice&apos; scheme implemented on the autobuilder around Sept 6-9, the responsiveness of qemu has improved and we believe that this bug may not occur again. Lowering to medium priority.</thetext>
  </long_desc><long_desc isprivate="0" >
    <commentid>88615</commentid>
    <comment_count>2</comment_count>
    <who name="Anuj Mittal">anuj.mittal</who>
    <bug_when>2020-11-17 15:17:13 +0000</bug_when>
    <thetext>I got this issue today while building next set of changes for gatesgarth. This was on Ubuntu1804-ty2 while executing do_testimage for core-image-sato.

https://autobuilder.yoctoproject.org/typhoon/#/builders/72/builds/2745/steps/9/logs/step2c

Traceback (most recent call last):
  File &quot;/home/pokybuild/yocto-worker/qa-extras2/build/meta/lib/oeqa/core/decorator/__init__.py&quot;, line 36, in wrapped_f
    return func(*args, **kwargs)
  File &quot;/home/pokybuild/yocto-worker/qa-extras2/build/meta/lib/oeqa/runtime/cases/ping.py&quot;, line 19, in test_ping
    output += proc.communicate()[0].decode(&apos;utf-8&apos;)
  File &quot;/usr/lib/python3.6/subprocess.py&quot;, line 850, in communicate
    stdout = self.stdout.read()
  File &quot;/home/pokybuild/yocto-worker/qa-extras2/build/meta/lib/oeqa/core/decorator/oetimeout.py&quot;, line 19, in _timeoutHandler
    &quot;seconds of execution&quot; % timeout)
oeqa.core.exception.OEQATimeoutError: Timed out after 30 seconds of execution</thetext>
  </long_desc><long_desc isprivate="0" >
    <commentid>88956</commentid>
    <comment_count>3</comment_count>
    <who name="Chee Yang">chee.yang.lee</who>
    <bug_when>2021-01-19 09:30:06 +0000</bug_when>
    <thetext>happen again ( master, ubuntu1804-ty-2, core-image-sato )

https://autobuilder.yoctoproject.org/typhoon/#/builders/53/builds/2955/steps/13/logs/stdio</thetext>
  </long_desc><long_desc isprivate="0" >
    <commentid>89012</commentid>
    <comment_count>4</comment_count>
    <who name="Alexandre Belloni">alexandre.belloni</who>
    <bug_when>2021-01-25 09:59:11 +0000</bug_when>
    <thetext>Happened again:

https://autobuilder.yoctoproject.org/typhoon/#/builders/47/builds/2979/steps/12/logs/stdio
https://autobuilder.yoctoproject.org/typhoon/#/builders/102/builds/1304/steps/13/logs/stdio</thetext>
  </long_desc><long_desc isprivate="0" >
    <commentid>89031</commentid>
    <comment_count>5</comment_count>
    <who name="Alexandre Belloni">alexandre.belloni</who>
    <bug_when>2021-01-26 18:24:02 +0000</bug_when>
    <thetext>https://autobuilder.yoctoproject.org/typhoon/#/builders/74/builds/2945</thetext>
  </long_desc><long_desc isprivate="0" >
    <commentid>89032</commentid>
    <comment_count>6</comment_count>
    <who name="Alexandre Belloni">alexandre.belloni</who>
    <bug_when>2021-01-26 18:33:09 +0000</bug_when>
    <thetext>https://autobuilder.yoctoproject.org/typhoon/#/builders/60/builds/2844/steps/10/logs/step1c</thetext>
  </long_desc><long_desc isprivate="0" >
    <commentid>89103</commentid>
    <comment_count>7</comment_count>
    <who name="Alexandre Belloni">alexandre.belloni</who>
    <bug_when>2021-02-01 10:03:45 +0000</bug_when>
    <thetext>https://autobuilder.yoctoproject.org/typhoon/#/builders/74/builds/2990/steps/13/logs/stdio</thetext>
  </long_desc><long_desc isprivate="0" >
    <commentid>89211</commentid>
    <comment_count>8</comment_count>
    <who name="Minjae Kim">flowergom</who>
    <bug_when>2021-02-11 14:02:08 +0000</bug_when>
    <thetext>Happened again:
https://autobuilder.yoctoproject.org/typhoon/#/builders/45/builds/3048/steps/12/logs/stdio</thetext>
  </long_desc><long_desc isprivate="0" >
    <commentid>89243</commentid>
    <comment_count>9</comment_count>
    <who name="Minjae Kim">flowergom</who>
    <bug_when>2021-02-12 00:51:45 +0000</bug_when>
    <thetext>Happened again:
https://autobuilder.yoctoproject.org/typhoon/#/builders/81/builds/1797/steps/12/logs/stdio</thetext>
  </long_desc><long_desc isprivate="0" >
    <commentid>89390</commentid>
    <comment_count>10</comment_count>
    <who name="Randy MacLeod">randy.macleod</who>
    <bug_when>2021-02-25 15:34:17 +0000</bug_when>
    <thetext>*** Bug 14240 has been marked as a duplicate of this bug. ***</thetext>
  </long_desc><long_desc isprivate="0" >
    <commentid>89430</commentid>
    <comment_count>11</comment_count>
    <who name="Alexandre Belloni">alexandre.belloni</who>
    <bug_when>2021-02-27 01:03:43 +0000</bug_when>
    <thetext>New occurence ( opensuse151-ty-1 , qemumips64 ):

https://autobuilder.yoctoproject.org/typhoon/#/builders/74/builds/3114/steps/13/logs/stdio</thetext>
  </long_desc><long_desc isprivate="0" >
    <commentid>89672</commentid>
    <comment_count>12</comment_count>
    <who name="Oleksiy Obitotskyy">oobitots</who>
    <bug_when>2021-03-22 07:30:09 +0000</bug_when>
    <thetext>Happened again:

ubuntu1804-ty-3 qemumips64

https://autobuilder.yoctoproject.org/typhoon/#/builders/74/builds/3217/steps/13/logs/stdio</thetext>
  </long_desc><long_desc isprivate="0" >
    <commentid>89691</commentid>
    <comment_count>13</comment_count>
    <who name="Oleksiy Obitotskyy">oobitots</who>
    <bug_when>2021-03-23 06:12:46 +0000</bug_when>
    <thetext>https://autobuilder.yoctoproject.org/typhoon/#/builders/85/builds/1366

https://autobuilder.yoctoproject.org/typhoon/#/builders/63/builds/3209/steps/13/logs/stdio

Started HTTPService on 0.0.0.0:38301
Test requires apt to be installed
Stopped HTTPService on 0.0.0.0:38301
Traceback (most recent call last):
  File &quot;/home/pokybuild/yocto-worker/qemuppc/build/meta/lib/oeqa/core/decorator/__init__.py&quot;, line 36, in wrapped_f
    return func(*args, **kwargs)
  File &quot;/home/pokybuild/yocto-worker/qemuppc/build/meta/lib/oeqa/runtime/cases/ping.py&quot;, line 19, in test_ping
    output += proc.communicate()[0].decode(&apos;utf-8&apos;)
  File &quot;/usr/lib/python3.6/subprocess.py&quot;, line 850, in communicate
    stdout = self.stdout.read()
  File &quot;/home/pokybuild/yocto-worker/qemuppc/build/meta/lib/oeqa/core/decorator/oetimeout.py&quot;, line 19, in _timeoutHandler
    &quot;seconds of execution&quot; % timeout)
oeqa.core.exception.OEQATimeoutError: Timed out after 30 seconds of execution</thetext>
  </long_desc><long_desc isprivate="0" >
    <commentid>89744</commentid>
    <comment_count>14</comment_count>
    <who name="Oleksiy Obitotskyy">oobitots</who>
    <bug_when>2021-03-25 11:01:11 +0000</bug_when>
    <thetext>qemux86-64 core-image-sato 

lib32
https://autobuilder.yoctoproject.org/typhoon/#/builders/44/builds/3267</thetext>
  </long_desc><long_desc isprivate="0" >
    <commentid>89805</commentid>
    <comment_count>15</comment_count>
    <who name="Paul Eggleton">bluelightning</who>
    <bug_when>2021-03-29 03:45:20 +0000</bug_when>
    <thetext>Seems reasonable to assume this is the same issue: (qemuarm, ping succeeded but SSH subsequently failed):

https://autobuilder.yoctoproject.org/typhoon/#/builders/53/builds/3263</thetext>
  </long_desc><long_desc isprivate="0" >
    <commentid>89834</commentid>
    <comment_count>16</comment_count>
    <who name="Paul Eggleton">bluelightning</who>
    <bug_when>2021-04-01 02:25:56 +0000</bug_when>
    <thetext>qemuppc ping test failed:
https://autobuilder.yoctoproject.org/typhoon/#/builders/63/builds/3236/steps/13/logs/stdio

multilib mip64 n32 ping test failed:
https://autobuilder.yoctoproject.org/typhoon/#/builders/44/builds/3278/steps/26/logs/stdio</thetext>
  </long_desc><long_desc isprivate="0" >
    <commentid>89935</commentid>
    <comment_count>17</comment_count>
    <who name="Alejandro">alejandro</who>
    <bug_when>2021-04-14 22:47:05 +0000</bug_when>
    <thetext>Happened again:

qemumips64:
https://autobuilder.yoctoproject.org/typhoon/#/builders/74/builds/3289

multilib:
https://autobuilder.yoctoproject.org/typhoon/#/builders/44/builds/3324/steps/18/logs/stdio</thetext>
  </long_desc><long_desc isprivate="0" >
    <commentid>90196</commentid>
    <comment_count>18</comment_count>
    <who name="Alexandre Belloni">alexandre.belloni</who>
    <bug_when>2021-04-29 22:30:59 +0000</bug_when>
    <thetext>https://autobuilder.yoctoproject.org/typhoon/#/builders/44/builds/3380/steps/21/logs/stdio

master on ubuntu1804-ty-2</thetext>
  </long_desc><long_desc isprivate="0" >
    <commentid>90212</commentid>
    <comment_count>19</comment_count>
    <who name="Alexandre Belloni">alexandre.belloni</who>
    <bug_when>2021-05-01 23:10:12 +0000</bug_when>
    <thetext>https://autobuilder.yoctoproject.org/typhoon/#/builders/44/builds/3368/steps/26/logs/stdio

qemumips64
master-next on ubuntu2004-ty-1</thetext>
  </long_desc><long_desc isprivate="0" >
    <commentid>90261</commentid>
    <comment_count>20</comment_count>
    <who name="Alexandre Belloni">alexandre.belloni</who>
    <bug_when>2021-05-06 12:21:43 +0000</bug_when>
    <thetext>https://autobuilder.yoctoproject.org/typhoon/#/builders/74/builds/3359/steps/13/logs/stdio

qemumips64
master on centos8-ty-2</thetext>
  </long_desc><long_desc isprivate="0" >
    <commentid>90658</commentid>
    <comment_count>21</comment_count>
    <who name="Alexandre Belloni">alexandre.belloni</who>
    <bug_when>2021-06-16 13:51:09 +0000</bug_when>
    <thetext>https://autobuilder.yoctoproject.org/typhoon/#/builders/74/builds/3511/steps/13/logs/stdio

qemumips64
debian10-ty-1</thetext>
  </long_desc><long_desc isprivate="0" >
    <commentid>90818</commentid>
    <comment_count>22</comment_count>
    <who name="Randy MacLeod">randy.macleod</who>
    <bug_when>2021-07-01 13:22:11 +0000</bug_when>
    <thetext>Wait a month or two to see if it happens now that the RCU hang bug fix is in.
It may still happen on due to heavy load and RCU stalls.</thetext>
  </long_desc><long_desc isprivate="0" >
    <commentid>92402</commentid>
    <comment_count>23</comment_count>
    <who name="Alexandre Belloni">alexandre.belloni</who>
    <bug_when>2022-01-26 23:17:06 +0000</bug_when>
    <thetext>https://autobuilder.yoctoproject.org/typhoon/#/builders/53/builds/4646/steps/13/logs/stdio

stream8-ty-1 has an SSD


https://autobuilder.yoctoproject.org/typhoon/#/builders/44/builds/4669/steps/12/logs/stdio

centos8-ty-2 non-SSD

Both during the same a-full build</thetext>
  </long_desc><long_desc isprivate="0" >
    <commentid>92408</commentid>
    <comment_count>24</comment_count>
    <who name="Alexandre Belloni">alexandre.belloni</who>
    <bug_when>2022-01-26 23:53:19 +0000</bug_when>
    <thetext>https://autobuilder.yoctoproject.org/typhoon/#/builders/95/builds/2823/steps/12/logs/stdio
https://autobuilder.yoctoproject.org/typhoon/#/builders/101/builds/3475/steps/13/logs/stdio
https://autobuilder.yoctoproject.org/typhoon/#/builders/79/builds/3082/steps/14/logs/stdio

All on stream8-ty-1 that has an SSD


Interestingly, the last one has:
ping: socket: Operation not permitted</thetext>
  </long_desc><long_desc isprivate="0" >
    <commentid>92411</commentid>
    <comment_count>25</comment_count>
    <who name="Alexandre Belloni">alexandre.belloni</who>
    <bug_when>2022-01-27 15:09:06 +0000</bug_when>
    <thetext>https://autobuilder.yoctoproject.org/typhoon/#/builders/95/builds/2834
https://autobuilder.yoctoproject.org/typhoon/#/builders/59/builds/4631

Those two are again on stream8 which has an issue</thetext>
  </long_desc><long_desc isprivate="0" >
    <commentid>92433</commentid>
    <comment_count>26</comment_count>
    <who name="Alexandre Belloni">alexandre.belloni</who>
    <bug_when>2022-01-31 20:42:30 +0000</bug_when>
    <thetext>https://autobuilder.yoctoproject.org/typhoon/#/builders/57/builds/4612/steps/12/logs/stdio

centos8-ty-1, is this the same issue as on stream8?</thetext>
  </long_desc><long_desc isprivate="0" >
    <commentid>92434</commentid>
    <comment_count>27</comment_count>
    <who name="Alexandre Belloni">alexandre.belloni</who>
    <bug_when>2022-01-31 21:33:01 +0000</bug_when>
    <thetext>https://autobuilder.yoctoproject.org/typhoon/#/builders/79/builds/3104/steps/14/logs/stdio

centos8-ty-1</thetext>
  </long_desc><long_desc isprivate="0" >
    <commentid>92435</commentid>
    <comment_count>28</comment_count>
    <who name="Alexandre Belloni">alexandre.belloni</who>
    <bug_when>2022-01-31 21:39:40 +0000</bug_when>
    <thetext>https://autobuilder.yoctoproject.org/typhoon/#/builders/101/builds/3496/steps/13/logs/stdio

centos8-ty-1</thetext>
  </long_desc><long_desc isprivate="0" >
    <commentid>92436</commentid>
    <comment_count>29</comment_count>
    <who name="Alexandre Belloni">alexandre.belloni</who>
    <bug_when>2022-01-31 21:43:31 +0000</bug_when>
    <thetext>https://autobuilder.yoctoproject.org/typhoon/#/builders/69/builds/4636/steps/12/logs/stdio
https://autobuilder.yoctoproject.org/typhoon/#/builders/69/builds/4636/steps/15/logs/stdio
Still centos8-ty-1 (note that stream8 is currently paused)</thetext>
  </long_desc><long_desc isprivate="0" >
    <commentid>92450</commentid>
    <comment_count>30</comment_count>
    <who name="Alexandre Belloni">alexandre.belloni</who>
    <bug_when>2022-02-02 22:01:20 +0000</bug_when>
    <thetext>https://autobuilder.yoctoproject.org/typhoon/#/builders/69/builds/4642/steps/12/logs/stdio
Still centos8</thetext>
  </long_desc><long_desc isprivate="0" >
    <commentid>92453</commentid>
    <comment_count>31</comment_count>
    <who name="Alexandre Belloni">alexandre.belloni</who>
    <bug_when>2022-02-02 22:34:21 +0000</bug_when>
    <thetext>https://autobuilder.yoctoproject.org/typhoon/#/builders/56/builds/1748/steps/14/logs/stdio
This is on ubuntu1804-ty-3</thetext>
  </long_desc><long_desc isprivate="0" >
    <commentid>92454</commentid>
    <comment_count>32</comment_count>
    <who name="Alexandre Belloni">alexandre.belloni</who>
    <bug_when>2022-02-02 22:39:58 +0000</bug_when>
    <thetext>https://autobuilder.yoctoproject.org/typhoon/#/builders/59/builds/4651/steps/13/logs/stdio
https://autobuilder.yoctoproject.org/typhoon/#/builders/50/builds/4673/steps/12/logs/stdio
Both on centos8</thetext>
  </long_desc><long_desc isprivate="0" >
    <commentid>92455</commentid>
    <comment_count>33</comment_count>
    <who name="Alexandre Belloni">alexandre.belloni</who>
    <bug_when>2022-02-02 22:44:52 +0000</bug_when>
    <thetext>https://autobuilder.yoctoproject.org/typhoon/#/builders/76/builds/4643/steps/12/logs/stdio
https://autobuilder.yoctoproject.org/typhoon/#/builders/69/builds/4644/steps/12/logs/stdio
https://autobuilder.yoctoproject.org/typhoon/#/builders/47/builds/4673/steps/12/logs/stdio
https://autobuilder.yoctoproject.org/typhoon/#/builders/95/builds/2845/steps/12/logs/stdio
https://autobuilder.yoctoproject.org/typhoon/#/builders/57/builds/4617/steps/12/logs/stdio
All on centos8</thetext>
  </long_desc><long_desc isprivate="0" >
    <commentid>92617</commentid>
    <comment_count>34</comment_count>
    <who name="Oleksiy Obitotskyy">oobitots</who>
    <bug_when>2022-02-21 09:55:14 +0000</bug_when>
    <thetext>https://autobuilder.yoctoproject.org/typhoon/#builders/107/builds/2661/steps/13/logs/stdio

qemuppc-alt ubuntu2004-ty-1</thetext>
  </long_desc><long_desc isprivate="0" >
    <commentid>92728</commentid>
    <comment_count>35</comment_count>
    <who name="Steve Sakoman">steve</who>
    <bug_when>2022-03-04 14:59:07 +0000</bug_when>
    <thetext>Dunfell occurrence:

https://autobuilder.yoctoproject.org/typhoon/#/builders/74/builds/4786

qemumips64 ubuntu2004-ty-1</thetext>
  </long_desc><long_desc isprivate="0" >
    <commentid>92778</commentid>
    <comment_count>36</comment_count>
    <who name="Steve Sakoman">steve</who>
    <bug_when>2022-03-14 16:45:08 +0000</bug_when>
    <thetext>Dunfell occurrence:

https://autobuilder.yoctoproject.org/typhoon/#/builders/107/builds/2760

qemuppc-alt ubuntu1804-ty-3</thetext>
  </long_desc><long_desc isprivate="0" >
    <commentid>92787</commentid>
    <comment_count>37</comment_count>
    <who name="Alexandre Belloni">alexandre.belloni</who>
    <bug_when>2022-03-17 10:24:58 +0000</bug_when>
    <thetext>https://autobuilder.yoctoproject.org/typhoon/#/builders/102/builds/2752/steps/14/logs/stdio

qemumips-alt debian9-ty-2

https://autobuilder.yoctoproject.org/typhoon/#/builders/72/builds/4877/steps/29/logs/stdio

qa-extras2 centos8-ty-2</thetext>
  </long_desc><long_desc isprivate="0" >
    <commentid>92934</commentid>
    <comment_count>38</comment_count>
    <who name="Alexandre Belloni">alexandre.belloni</who>
    <bug_when>2022-04-06 12:23:30 +0000</bug_when>
    <thetext>https://autobuilder.yoctoproject.org/typhoon/#/builders/102/builds/2888/steps/12/logs/stdio
qemumips-alt ubuntu1804-ty-3


AssertionError: Ping timeout error for address 192.168.7.6, count 0, output: PING 192.168.7.6 (192.168.7.6) 56(84) bytes of data.
--- 192.168.7.6 ping statistics ---
1 packets transmitted, 0 received, 100% packet loss, time 0ms
PING 192.168.7.6 (192.168.7.6) 56(84) bytes of data.
From 192.168.7.5 icmp_seq=1 Destination Host Unreachable
--- 192.168.7.6 ping statistics ---
1 packets transmitted, 0 received, +1 errors, 100% packet loss, time 0ms
PING 192.168.7.6 (192.168.7.6) 56(84) bytes of data.
From 192.168.7.5 icmp_seq=1 Destination Host Unreachable
--- 192.168.7.6 ping statistics ---
1 packets transmitted, 0 received, +1 errors, 100% packet loss, time 0ms
PING 192.168.7.6 (192.168.7.6) 56(84) bytes of data.
From 192.168.7.5 icmp_seq=1 Destination Host Unreachable
--- 192.168.7.6 ping statistics ---
1 packets transmitted, 0 received, +1 errors, 100% packet loss, time 0ms
PING 192.168.7.6 (192.168.7.6) 56(84) bytes of data.
From 192.168.7.5 icmp_seq=1 Destination Host Unreachable
--- 192.168.7.6 ping statistics ---
1 packets transmitted, 0 received, +1 errors, 100% packet loss, time 0ms
PING 192.168.7.6 (192.168.7.6) 56(84) bytes of data.
From 192.168.7.5 icmp_seq=1 Destination Host Unreachable
--- 192.168.7.6 ping statistics ---
1 packets transmitted, 0 received, +1 errors, 100% packet loss, time 0ms
PING 192.168.7.6 (192.168.7.6) 56(84) bytes of data.
From 192.168.7.5 icmp_seq=1 Destination Host Unreachable
--- 192.168.7.6 ping statistics ---
1 packets transmitted, 0 received, +1 errors, 100% packet loss, time 0ms</thetext>
  </long_desc><long_desc isprivate="0" >
    <commentid>93072</commentid>
    <comment_count>39</comment_count>
    <who name="Randy MacLeod">randy.macleod</who>
    <bug_when>2022-04-14 15:14:21 +0000</bug_when>
    <thetext>We hope the systemd issues are resolved with:
https://git.yoctoproject.org/poky/commit?id=89efab2850766378d89579c094670357775b69b6 

If there are similar problems, please open a new bug.</thetext>
  </long_desc>
      
      

    </bug>

</bugzilla>