<?xml version="1.0" encoding="UTF-8" standalone="yes" ?>
<!DOCTYPE bugzilla SYSTEM "https://bugzilla.yoctoproject.org/page.cgi?id=bugzilla.dtd">

<bugzilla version="5.0.6"
          urlbase="https://bugzilla.yoctoproject.org/"
          
          maintainer="it-coreprojects-helpdesk@linuxfoundation.org"
>

    <bug>
          <bug_id>1404</bug_id>
          
          <creation_ts>2011-08-25 14:20:06 +0000</creation_ts>
          <short_desc>x32: libzypp compilation fails</short_desc>
          <delta_ts>2011-12-01 12:25:40 +0000</delta_ts>
          <reporter_accessible>1</reporter_accessible>
          <cclist_accessible>1</cclist_accessible>
          <classification_id>7</classification_id>
          <classification>Build System, Metadata &amp; Runtime</classification>
          <product>OE-Core</product>
          <component>core</component>
          <version>unspecified</version>
          <rep_platform>x86</rep_platform>
          <op_sys>x86_64</op_sys>
          <bug_status>RESOLVED</bug_status>
          <resolution>WORKSFORME</resolution>
          
          
          <bug_file_loc></bug_file_loc>
          <status_whiteboard></status_whiteboard>
          <keywords></keywords>
          <priority>Medium</priority>
          <bug_severity>normal</bug_severity>
          <target_milestone>1.2</target_milestone>
          
          <blocked>1579</blocked>
          <everconfirmed>1</everconfirmed>
          <reporter name="Nitin Kamble">nitin.a.kamble</reporter>
          <assigned_to name="Nitin Kamble">nitin.a.kamble</assigned_to>
          <cc>hjl.tools</cc>
    
    <cc>meta.mr.watcher</cc>
    
    <cc>meta.watcher</cc>
          
          
          <cf_os>---</cf_os>
          <cf_regression_type>---</cf_regression_type>
          
          <cf_docchange>---</cf_docchange>

      

      

      

          <comment_sort_order>oldest_to_newest</comment_sort_order>  
          <long_desc isprivate="0" >
    <commentid>15769</commentid>
    <comment_count>0</comment_count>
    <who name="Nitin Kamble">nitin.a.kamble</who>
    <bug_when>2011-08-25 14:20:06 +0000</bug_when>
    <thetext>ERROR: Logfile of failure stored in: /disk0/pokybuild/build-multilib-x32-qemu/tmp/work/qemux86_64-poky-linux-gnux32/libzypp-0.0-git1+15b6c52260bbc52b3d8e585e271b67e10cc7c433-r13/temp/log.do_compile.7326
Log data follows:
| DEBUG: SITE files [&apos;endian-little&apos;, &apos;common-linux&apos;, &apos;common-glibc&apos;, &apos;bit-32&apos;, &apos;ix86-common&apos;, &apos;x86_64-linux-gnux32&apos;, &apos;common&apos;]
| NOTE: make -j 16
| /disk0/pokybuild/build-multilib-x32-qemu/tmp/sysroots/x86_64-linux/usr/bin/cmake -H/disk0/pokybuild/build-multilib-x32-qemu/tmp/work/qemux86_64-poky-linux-gnux32/libzypp-0.0-git1+15b6c52260bbc52b3d8e585e271b67e10cc7c433-r13/git -B/disk0/pokybuild/build-multilib-x32-qemu/tmp/work/qemux86_64-poky-linux-gnux32/libzypp-0.0-git1+15b6c52260bbc52b3d8e585e271b67e10cc7c433-r13/git --check-build-system CMakeFiles/Makefile.cmake 0
| /disk0/pokybuild/build-multilib-x32-qemu/tmp/sysroots/x86_64-linux/usr/bin/cmake -E cmake_progress_start /disk0/pokybuild/build-multilib-x32-qemu/tmp/work/qemux86_64-poky-linux-gnux32/libzypp-0.0-git1+15b6c52260bbc52b3d8e585e271b67e10cc7c433-r13/git/CMakeFiles /disk0/pokybuild/build-multilib-x32-qemu/tmp/work/qemux86_64-poky-linux-gnux32/libzypp-0.0-git1+15b6c52260bbc52b3d8e585e271b67e10cc7c433-r13/git/CMakeFiles/progress.marks
| make -f CMakeFiles/Makefile2 all
| make[1]: Entering directory `/disk0/pokybuild/build-multilib-x32-qemu/tmp/work/qemux86_64-poky-linux-gnux32/libzypp-0.0-git1+15b6c52260bbc52b3d8e585e271b67e10cc7c433-r13/git&apos;
| make -f zypp/CMakeFiles/zypp.dir/build.make zypp/CMakeFiles/zypp.dir/depend
| make -f vendor/mongoose/CMakeFiles/mongoose.dir/build.make vendor/mongoose/CMakeFiles/mongoose.dir/depend
| make[2]: Entering directory `/disk0/pokybuild/build-multilib-x32-qemu/tmp/work/qemux86_64-poky-linux-gnux32/libzypp-0.0-git1+15b6c52260bbc52b3d8e585e271b67e10cc7c433-r13/git&apos;
| cd /disk0/pokybuild/build-multilib-x32-qemu/tmp/work/qemux86_64-poky-linux-gnux32/libzypp-0.0-git1+15b6c52260bbc52b3d8e585e271b67e10cc7c433-r13/git &amp;&amp; /disk0/pokybuild/build-multilib-x32-qemu/tmp/sysroots/x86_64-linux/usr/bin/cmake -E cmake_depends &quot;Unix Makefiles&quot; /disk0/pokybuild/build-multilib-x32-qemu/tmp/work/qemux86_64-poky-linux-gnux32/libzypp-0.0-git1+15b6c52260bbc52b3d8e585e271b67e10cc7c433-r13/git /disk0/pokybuild/build-multilib-x32-qemu/tmp/work/qemux86_64-poky-linux-gnux32/libzypp-0.0-git1+15b6c52260bbc52b3d8e585e271b67e10cc7c433-r13/git/vendor/mongoose /disk0/pokybuild/build-multilib-x32-qemu/tmp/work/qemux86_64-poky-linux-gnux32/libzypp-0.0-git1+15b6c52260bbc52b3d8e585e271b67e10cc7c433-r13/git /disk0/pokybuild/build-multilib-x32-qemu/tmp/work/qemux86_64-poky-linux-gnux32/libzypp-0.0-git1+15b6c52260bbc52b3d8e585e271b67e10cc7c433-r13/git/vendor/mongoose /disk0/pokybuild/build-multilib-x32-qemu/tmp/work/qemux86_64-poky-linux-gnux32/libzypp-0.0-git1+15b6c52260bbc52b3d8e585e271b67e10cc7c433-r13/git/vendor/mongoose/CMakeFiles/mongoose.dir/DependInfo.cmake --color=
| make[2]: Leaving directory `/disk0/pokybuild/build-multilib-x32-qemu/tmp/work/qemux86_64-poky-linux-gnux32/libzypp-0.0-git1+15b6c52260bbc52b3d8e585e271b67e10cc7c433-r13/git&apos;
| make -f vendor/mongoose/CMakeFiles/mongoose.dir/build.make vendor/mongoose/CMakeFiles/mongoose.dir/build
| make[2]: Entering directory `/disk0/pokybuild/build-multilib-x32-qemu/tmp/work/qemux86_64-poky-linux-gnux32/libzypp-0.0-git1+15b6c52260bbc52b3d8e585e271b67e10cc7c433-r13/git&apos;
| make[2]: Nothing to be done for `vendor/mongoose/CMakeFiles/mongoose.dir/build&apos;.
| make[2]: Leaving directory `/disk0/pokybuild/build-multilib-x32-qemu/tmp/work/qemux86_64-poky-linux-gnux32/libzypp-0.0-git1+15b6c52260bbc52b3d8e585e271b67e10cc7c433-r13/git&apos;
| /disk0/pokybuild/build-multilib-x32-qemu/tmp/sysroots/x86_64-linux/usr/bin/cmake -E cmake_progress_report /disk0/pokybuild/build-multilib-x32-qemu/tmp/work/qemux86_64-poky-linux-gnux32/libzypp-0.0-git1+15b6c52260bbc52b3d8e585e271b67e10cc7c433-r13/git/CMakeFiles
| [  0%] Built target mongoose
| make[2]: Entering directory `/disk0/pokybuild/build-multilib-x32-qemu/tmp/work/qemux86_64-poky-linux-gnux32/libzypp-0.0-git1+15b6c52260bbc52b3d8e585e271b67e10cc7c433-r13/git&apos;
| cd /disk0/pokybuild/build-multilib-x32-qemu/tmp/work/qemux86_64-poky-linux-gnux32/libzypp-0.0-git1+15b6c52260bbc52b3d8e585e271b67e10cc7c433-r13/git &amp;&amp; /disk0/pokybuild/build-multilib-x32-qemu/tmp/sysroots/x86_64-linux/usr/bin/cmake -E cmake_depends &quot;Unix Makefiles&quot; /disk0/pokybuild/build-multilib-x32-qemu/tmp/work/qemux86_64-poky-linux-gnux32/libzypp-0.0-git1+15b6c52260bbc52b3d8e585e271b67e10cc7c433-r13/git /disk0/pokybuild/build-multilib-x32-qemu/tmp/work/qemux86_64-poky-linux-gnux32/libzypp-0.0-git1+15b6c52260bbc52b3d8e585e271b67e10cc7c433-r13/git/zypp /disk0/pokybuild/build-multilib-x32-qemu/tmp/work/qemux86_64-poky-linux-gnux32/libzypp-0.0-git1+15b6c52260bbc52b3d8e585e271b67e10cc7c433-r13/git /disk0/pokybuild/build-multilib-x32-qemu/tmp/work/qemux86_64-poky-linux-gnux32/libzypp-0.0-git1+15b6c52260bbc52b3d8e585e271b67e10cc7c433-r13/git/zypp /disk0/pokybuild/build-multilib-x32-qemu/tmp/work/qemux86_64-poky-linux-gnux32/libzypp-0.0-git1+15b6c52260bbc52b3d8e585e271b67e10cc7c433-r13/git/zypp/CMakeFiles/zypp.dir/DependInfo.cmake --color=
| make[2]: Leaving directory `/disk0/pokybuild/build-multilib-x32-qemu/tmp/work/qemux86_64-poky-linux-gnux32/libzypp-0.0-git1+15b6c52260bbc52b3d8e585e271b67e10cc7c433-r13/git&apos;
| make -f zypp/CMakeFiles/zypp.dir/build.make zypp/CMakeFiles/zypp.dir/build
| make[2]: Entering directory `/disk0/pokybuild/build-multilib-x32-qemu/tmp/work/qemux86_64-poky-linux-gnux32/libzypp-0.0-git1+15b6c52260bbc52b3d8e585e271b67e10cc7c433-r13/git&apos;
| /disk0/pokybuild/build-multilib-x32-qemu/tmp/sysroots/x86_64-linux/usr/bin/cmake -E cmake_progress_report /disk0/pokybuild/build-multilib-x32-qemu/tmp/work/qemux86_64-poky-linux-gnux32/libzypp-0.0-git1+15b6c52260bbc52b3d8e585e271b67e10cc7c433-r13/git/CMakeFiles 93
| [  1%] Building CXX object zypp/CMakeFiles/zypp.dir/Arch.cc.o
| cd /disk0/pokybuild/build-multilib-x32-qemu/tmp/work/qemux86_64-poky-linux-gnux32/libzypp-0.0-git1+15b6c52260bbc52b3d8e585e271b67e10cc7c433-r13/git/zypp &amp;&amp; /disk0/pokybuild/build-multilib-x32-qemu/tmp/sysroots/x86_64-linux/usr/bin/x86_64-x32-poky-linux-gnux32/x86_64-poky-linux-gnux32-g++   -Dzypp_EXPORTS -D_FILE_OFFSET_BITS=64 -DVERSION=\&quot;8.11.0\&quot; -D_RPM_5 -DLOCALEDIR=\&quot;/usr/share/locale\&quot; -DTEXTDOMAIN=\&quot;zypp\&quot; -mx32   --sysroot=/disk0/pokybuild/build-multilib-x32-qemu/tmp/sysroots/qemux86-64  -O2 -pipe -g -feliminate-unused-debug-types -fpermissive -fvisibility-inlines-hidden -fpermissive -fno-strict-aliasing -fPIC -g -Wall -Werror=format-security -Woverloaded-virtual -Wnon-virtual-dtor -Wl,-as-needed -fPIC -I/disk0/pokybuild/build-multilib-x32-qemu/tmp/work/qemux86_64-poky-linux-gnux32/libzypp-0.0-git1+15b6c52260bbc52b3d8e585e271b67e10cc7c433-r13/git -I/disk0/pokybuild/build-multilib-x32-qemu/tmp/sysroots/qemux86-64/usr/include -I/disk0/pokybuild/build-multilib-x32-qemu/tmp/sysroots/qemux86-64/usr/include/rpm -I/disk0/pokybuild/build-multilib-x32-qemu/tmp/sysroots/qemux86-64/usr/include/libxml2 -I/disk0/pokybuild/build-multilib-x32-qemu/tmp/work/qemux86_64-poky-linux-gnux32/libzypp-0.0-git1+15b6c52260bbc52b3d8e585e271b67e10cc7c433-r13/git/zypp    -DZYPP_BASE_LOGGER_LOGGROUP=\&quot;zypp\&quot; -o CMakeFiles/zypp.dir/Arch.cc.o -c /disk0/pokybuild/build-multilib-x32-qemu/tmp/work/qemux86_64-poky-linux-gnux32/libzypp-0.0-git1+15b6c52260bbc52b3d8e585e271b67e10cc7c433-r13/git/zypp/Arch.cc
| In file included from /disk0/pokybuild/build-multilib-x32-qemu/tmp/work/qemux86_64-poky-linux-gnux32/libzypp-0.0-git1+15b6c52260bbc52b3d8e585e271b67e10cc7c433-r13/git/zypp/Arch.cc:240:0:
| /disk0/pokybuild/build-multilib-x32-qemu/tmp/work/qemux86_64-poky-linux-gnux32/libzypp-0.0-git1+15b6c52260bbc52b3d8e585e271b67e10cc7c433-r13/git/zypp/oe-arch.h: In constructor &apos;zypp::{anonymous}::ArchCompatSet::ArchCompatSet()&apos;:
| /disk0/pokybuild/build-multilib-x32-qemu/tmp/work/qemux86_64-poky-linux-gnux32/libzypp-0.0-git1+15b6c52260bbc52b3d8e585e271b67e10cc7c433-r13/git/zypp/oe-arch.h:29:28: error: &apos;_x86_64&apos; was not declared in this scope
| /disk0/pokybuild/build-multilib-x32-qemu/tmp/work/qemux86_64-poky-linux-gnux32/libzypp-0.0-git1+15b6c52260bbc52b3d8e585e271b67e10cc7c433-r13/git/zypp/oe-arch.h:29:36: error: &apos;x32&apos; was not declared in this scope
| In file included from /disk0/pokybuild/build-multilib-x32-qemu/tmp/work/qemux86_64-poky-linux-gnux32/libzypp-0.0-git1+15b6c52260bbc52b3d8e585e271b67e10cc7c433-r13/git/zypp/Arch.cc:339:0:
| /disk0/pokybuild/build-multilib-x32-qemu/tmp/work/qemux86_64-poky-linux-gnux32/libzypp-0.0-git1+15b6c52260bbc52b3d8e585e271b67e10cc7c433-r13/git/zypp/oe-arch.h: At global scope:
| /disk0/pokybuild/build-multilib-x32-qemu/tmp/work/qemux86_64-poky-linux-gnux32/libzypp-0.0-git1+15b6c52260bbc52b3d8e585e271b67e10cc7c433-r13/git/zypp/oe-arch.h:23:31: error: &apos;_x86_64&apos; was not declared in this scope
| /disk0/pokybuild/build-multilib-x32-qemu/tmp/work/qemux86_64-poky-linux-gnux32/libzypp-0.0-git1+15b6c52260bbc52b3d8e585e271b67e10cc7c433-r13/git/zypp/oe-arch.h:23:39: error: &apos;x32&apos; was not declared in this scope
| make[2]: *** [zypp/CMakeFiles/zypp.dir/Arch.cc.o] Error 1
| make[2]: Leaving directory `/disk0/pokybuild/build-multilib-x32-qemu/tmp/work/qemux86_64-poky-linux-gnux32/libzypp-0.0-git1+15b6c52260bbc52b3d8e585e271b67e10cc7c433-r13/git&apos;
| make[1]: *** [zypp/CMakeFiles/zypp.dir/all] Error 2
| make[1]: Leaving directory `/disk0/pokybuild/build-multilib-x32-qemu/tmp/work/qemux86_64-poky-linux-gnux32/libzypp-0.0-git1+15b6c52260bbc52b3d8e585e271b67e10cc7c433-r13/git&apos;
| make: *** [all] Error 2
| ERROR: oe_runmake failed
| ERROR: Function &apos;do_compile&apos; failed (see /disk0/pokybuild/build-multilib-x32-qemu/tmp/work/qemux86_64-poky-linux-gnux32/libzypp-0.0-git1+15b6c52260bbc52b3d8e585e271b67e10cc7c433-r13/temp/log.do_compile.7326 for further information)</thetext>
  </long_desc><long_desc isprivate="0" >
    <commentid>17452</commentid>
    <comment_count>1</comment_count>
    <who name="Nitin Kamble">nitin.a.kamble</who>
    <bug_when>2011-12-01 12:25:40 +0000</bug_when>
    <thetext>this issues does not happen on the current x32 layer.

Nitin</thetext>
  </long_desc>
      
      

    </bug>

</bugzilla>