<?xml version="1.0" encoding="UTF-8" standalone="yes" ?>
<!DOCTYPE bugzilla SYSTEM "https://bugzilla.yoctoproject.org/page.cgi?id=bugzilla.dtd">

<bugzilla version="5.0.6"
          urlbase="https://bugzilla.yoctoproject.org/"
          
          maintainer="it-coreprojects-helpdesk@linuxfoundation.org"
>

    <bug>
          <bug_id>1406</bug_id>
          
          <creation_ts>2011-08-25 14:24:32 +0000</creation_ts>
          <short_desc>x32: opensp compilation fails</short_desc>
          <delta_ts>2011-12-01 12:31:04 +0000</delta_ts>
          <reporter_accessible>1</reporter_accessible>
          <cclist_accessible>1</cclist_accessible>
          <classification_id>7</classification_id>
          <classification>Build System, Metadata &amp; Runtime</classification>
          <product>OE-Core</product>
          <component>core</component>
          <version>unspecified</version>
          <rep_platform>x86</rep_platform>
          <op_sys>x86_64</op_sys>
          <bug_status>RESOLVED</bug_status>
          <resolution>WORKSFORME</resolution>
          
          
          <bug_file_loc></bug_file_loc>
          <status_whiteboard></status_whiteboard>
          <keywords></keywords>
          <priority>Medium</priority>
          <bug_severity>normal</bug_severity>
          <target_milestone>1.2</target_milestone>
          
          <blocked>1579</blocked>
          <everconfirmed>1</everconfirmed>
          <reporter name="Nitin Kamble">nitin.a.kamble</reporter>
          <assigned_to name="Nitin Kamble">nitin.a.kamble</assigned_to>
          <cc>hjl.tools</cc>
    
    <cc>meta.mr.watcher</cc>
    
    <cc>meta.watcher</cc>
    
    <cc>nitin.a.kamble</cc>
          
          
          <cf_os>---</cf_os>
          <cf_regression_type>---</cf_regression_type>
          
          <cf_docchange>---</cf_docchange>

      

      

      

          <comment_sort_order>oldest_to_newest</comment_sort_order>  
          <long_desc isprivate="0" >
    <commentid>15771</commentid>
    <comment_count>0</comment_count>
    <who name="Nitin Kamble">nitin.a.kamble</who>
    <bug_when>2011-08-25 14:24:32 +0000</bug_when>
    <thetext>ERROR: Logfile of failure stored in: /disk0/pokybuild/build-multilib-x32-qemu/tmp/work/x86_64-x32-poky-linux-gnux32/opensp-1.5-r1/temp/log.do_compile.8236
Log data follows:
| DEBUG: SITE files [&apos;endian-little&apos;, &apos;common-linux&apos;, &apos;common-glibc&apos;, &apos;bit-32&apos;, &apos;ix86-common&apos;, &apos;x86_64-linux-gnux32&apos;, &apos;common&apos;]
| NOTE: make -j 16
| make  all-recursive
| make[1]: Entering directory `/disk0/pokybuild/build-multilib-x32-qemu/tmp/work/x86_64-x32-poky-linux-gnux32/opensp-1.5-r1/OpenSP-1.5&apos;
| Making all in pubtext
| make[2]: Entering directory `/disk0/pokybuild/build-multilib-x32-qemu/tmp/work/x86_64-x32-poky-linux-gnux32/opensp-1.5-r1/OpenSP-1.5/pubtext&apos;
| make[2]: Nothing to be done for `all&apos;.
| make[2]: Leaving directory `/disk0/pokybuild/build-multilib-x32-qemu/tmp/work/x86_64-x32-poky-linux-gnux32/opensp-1.5-r1/OpenSP-1.5/pubtext&apos;
| Making all in unicode
| make[2]: Entering directory `/disk0/pokybuild/build-multilib-x32-qemu/tmp/work/x86_64-x32-poky-linux-gnux32/opensp-1.5-r1/OpenSP-1.5/unicode&apos;
| make[2]: Nothing to be done for `all&apos;.
| make[2]: Leaving directory `/disk0/pokybuild/build-multilib-x32-qemu/tmp/work/x86_64-x32-poky-linux-gnux32/opensp-1.5-r1/OpenSP-1.5/unicode&apos;
| Making all in doc
| make[2]: Entering directory `/disk0/pokybuild/build-multilib-x32-qemu/tmp/work/x86_64-x32-poky-linux-gnux32/opensp-1.5-r1/OpenSP-1.5/doc&apos;
| make[2]: Nothing to be done for `all&apos;.
| make[2]: Leaving directory `/disk0/pokybuild/build-multilib-x32-qemu/tmp/work/x86_64-x32-poky-linux-gnux32/opensp-1.5-r1/OpenSP-1.5/doc&apos;
| Making all in include
| make[2]: Entering directory `/disk0/pokybuild/build-multilib-x32-qemu/tmp/work/x86_64-x32-poky-linux-gnux32/opensp-1.5-r1/OpenSP-1.5/include&apos;
| make[2]: Nothing to be done for `all&apos;.
| make[2]: Leaving directory `/disk0/pokybuild/build-multilib-x32-qemu/tmp/work/x86_64-x32-poky-linux-gnux32/opensp-1.5-r1/OpenSP-1.5/include&apos;
| Making all in generic
| make[2]: Entering directory `/disk0/pokybuild/build-multilib-x32-qemu/tmp/work/x86_64-x32-poky-linux-gnux32/opensp-1.5-r1/OpenSP-1.5/generic&apos;
| make[2]: Nothing to be done for `all&apos;.
| make[2]: Leaving directory `/disk0/pokybuild/build-multilib-x32-qemu/tmp/work/x86_64-x32-poky-linux-gnux32/opensp-1.5-r1/OpenSP-1.5/generic&apos;
| Making all in lib
| make[2]: Entering directory `/disk0/pokybuild/build-multilib-x32-qemu/tmp/work/x86_64-x32-poky-linux-gnux32/opensp-1.5-r1/OpenSP-1.5/lib&apos;
| make  all-am
| make[3]: Entering directory `/disk0/pokybuild/build-multilib-x32-qemu/tmp/work/x86_64-x32-poky-linux-gnux32/opensp-1.5-r1/OpenSP-1.5/lib&apos;
| make[3]: Nothing to be done for `all-am&apos;.
| make[3]: Leaving directory `/disk0/pokybuild/build-multilib-x32-qemu/tmp/work/x86_64-x32-poky-linux-gnux32/opensp-1.5-r1/OpenSP-1.5/lib&apos;
| make[2]: Leaving directory `/disk0/pokybuild/build-multilib-x32-qemu/tmp/work/x86_64-x32-poky-linux-gnux32/opensp-1.5-r1/OpenSP-1.5/lib&apos;
| Making all in nsgmls
| make[2]: Entering directory `/disk0/pokybuild/build-multilib-x32-qemu/tmp/work/x86_64-x32-poky-linux-gnux32/opensp-1.5-r1/OpenSP-1.5/nsgmls&apos;
| make  all-am
| make[3]: Entering directory `/disk0/pokybuild/build-multilib-x32-qemu/tmp/work/x86_64-x32-poky-linux-gnux32/opensp-1.5-r1/OpenSP-1.5/nsgmls&apos;
| /bin/sh ../x86_64-poky-linux-gnux32-libtool --tag=CXX   --mode=link ccache x86_64-poky-linux-gnux32-g++   -mx32  --sysroot=/disk0/pokybuild/build-multilib-x32-qemu/tmp/sysroots/qemux86-64  -O2 -pipe -g -feliminate-unused-debug-types -O2 -fpermissive -fvisibility-inlines-hidden  -Wl,-O1 -Wl,--hash-style=gnu -Wl,--as-needed -o onsgmls nsgmls.o SgmlsEventHandler.o RastEventHandler.o StringSet.o nsgmls_inst.o ../lib/libosp.la -lpthread
| x86_64-poky-linux-gnux32-libtool: link: ccache x86_64-poky-linux-gnux32-g++ -mx32 --sysroot=/disk0/pokybuild/build-multilib-x32-qemu/tmp/sysroots/qemux86-64 -O2 -pipe -g -feliminate-unused-debug-types -O2 -fpermissive -fvisibility-inlines-hidden -Wl,-O1 -Wl,--hash-style=gnu -Wl,--as-needed -o .libs/onsgmls nsgmls.o SgmlsEventHandler.o RastEventHandler.o StringSet.o nsgmls_inst.o  ../lib/.libs/libosp.so /disk0/pokybuild/build-multilib-x32-qemu/tmp/sysroots/qemux86-64/usr/lib/libstdc++.so -lm -lpthread -Wl,-rpath -Wl,/usr/lib
| RastEventHandler.o: In function `OpenSP::RastEventHandler::sgmlDecl(OpenSP::SgmlDeclEvent*)&apos;:
| /disk0/pokybuild/build-multilib-x32-qemu/tmp/work/x86_64-x32-poky-linux-gnux32/opensp-1.5-r1/OpenSP-1.5/nsgmls/RastEventHandler.cxx:152: undefined reference to `OpenSP::Sd::execToInternal(char const*) const&apos;
| /disk0/pokybuild/build-multilib-x32-qemu/tmp/work/x86_64-x32-poky-linux-gnux32/opensp-1.5-r1/OpenSP-1.5/nsgmls/RastEventHandler.cxx:153: undefined reference to `OpenSP::Sd::execToInternal(char const*) const&apos;
| /disk0/pokybuild/build-multilib-x32-qemu/tmp/work/x86_64-x32-poky-linux-gnux32/opensp-1.5-r1/OpenSP-1.5/nsgmls/RastEventHandler.cxx:154: undefined reference to `OpenSP::Sd::execToInternal(char const*) const&apos;
| /disk0/pokybuild/build-multilib-x32-qemu/tmp/work/x86_64-x32-poky-linux-gnux32/opensp-1.5-r1/OpenSP-1.5/nsgmls/RastEventHandler.cxx:155: undefined reference to `OpenSP::Sd::execToInternal(char const*) const&apos;
| RastEventHandler.o: In function `OpenSP::RastEventHandler::attributeInfo(OpenSP::AttributeList const&amp;, OpenSP::RastSubdocState::AttributeType)&apos;:
| /disk0/pokybuild/build-multilib-x32-qemu/tmp/work/x86_64-x32-poky-linux-gnux32/opensp-1.5-r1/OpenSP-1.5/nsgmls/RastEventHandler.cxx:752: undefined reference to `OpenSP::TokenizedAttributeValue::tokenLocation(unsigned int) const&apos;
| SgmlsEventHandler.o: In function `OpenSP::SgmlsEventHandler::endProlog(OpenSP::EndPrologEvent*)&apos;:
| /disk0/pokybuild/build-multilib-x32-qemu/tmp/work/x86_64-x32-poky-linux-gnux32/opensp-1.5-r1/OpenSP-1.5/nsgmls/SgmlsEventHandler.cxx:199: undefined reference to `OpenSP::Dtd::generalEntityIter() const&apos;
| SgmlsEventHandler.o: In function `OpenSP::SgmlsEventHandler::externalDataEntity(OpenSP::ExternalDataEntityEvent*)&apos;:
| /disk0/pokybuild/build-multilib-x32-qemu/tmp/work/x86_64-x32-poky-linux-gnux32/opensp-1.5-r1/OpenSP-1.5/nsgmls/SgmlsEventHandler.cxx:456: undefined reference to `OpenSP::Location::clear()&apos;
| SgmlsEventHandler.o: In function `OpenSP::SgmlsEventHandler::startElement(OpenSP::StartElementEvent*)&apos;:
| /disk0/pokybuild/build-multilib-x32-qemu/tmp/work/x86_64-x32-poky-linux-gnux32/opensp-1.5-r1/OpenSP-1.5/nsgmls/SgmlsEventHandler.cxx:319: undefined reference to `OpenSP::Location::clear()&apos;
| SgmlsEventHandler.o: In function `OpenSP::SgmlsEventHandler::subdocEntity(OpenSP::SubdocEntityEvent*)&apos;:
| /disk0/pokybuild/build-multilib-x32-qemu/tmp/work/x86_64-x32-poky-linux-gnux32/opensp-1.5-r1/OpenSP-1.5/nsgmls/SgmlsEventHandler.cxx:469: undefined reference to `OpenSP::Location::clear()&apos;
| collect2: error: ld returned 1 exit status
| make[3]: *** [onsgmls] Error 1
| make[3]: Leaving directory `/disk0/pokybuild/build-multilib-x32-qemu/tmp/work/x86_64-x32-poky-linux-gnux32/opensp-1.5-r1/OpenSP-1.5/nsgmls&apos;
| make[2]: *** [all] Error 2
| make[2]: Leaving directory `/disk0/pokybuild/build-multilib-x32-qemu/tmp/work/x86_64-x32-poky-linux-gnux32/opensp-1.5-r1/OpenSP-1.5/nsgmls&apos;
| make[1]: *** [all-recursive] Error 1
| make[1]: Leaving directory `/disk0/pokybuild/build-multilib-x32-qemu/tmp/work/x86_64-x32-poky-linux-gnux32/opensp-1.5-r1/OpenSP-1.5&apos;
| make: *** [all] Error 2
| ERROR: oe_runmake failed
| ERROR: Function &apos;do_compile&apos; failed (see /disk0/pokybuild/build-multilib-x32-qemu/tmp/work/x86_64-x32-poky-linux-gnux32/opensp-1.5-r1/temp/log.do_compile.8236 for further information)</thetext>
  </long_desc><long_desc isprivate="0" >
    <commentid>17454</commentid>
    <comment_count>1</comment_count>
    <who name="Nitin Kamble">nitin.a.kamble</who>
    <bug_when>2011-12-01 12:31:04 +0000</bug_when>
    <thetext>This issue does not happen on the latest meta-x32 layer
Nitin</thetext>
  </long_desc>
      
      

    </bug>

</bugzilla>