<?xml version="1.0" encoding="UTF-8" standalone="yes" ?>
<!DOCTYPE bugzilla SYSTEM "https://bugzilla.yoctoproject.org/page.cgi?id=bugzilla.dtd">

<bugzilla version="5.0.6"
          urlbase="https://bugzilla.yoctoproject.org/"
          
          maintainer="it-coreprojects-helpdesk@linuxfoundation.org"
>

    <bug>
          <bug_id>1408</bug_id>
          
          <creation_ts>2011-08-25 14:28:15 +0000</creation_ts>
          <short_desc>x32: systemtap build fails</short_desc>
          <delta_ts>2011-12-01 13:42:36 +0000</delta_ts>
          <reporter_accessible>1</reporter_accessible>
          <cclist_accessible>1</cclist_accessible>
          <classification_id>7</classification_id>
          <classification>Build System, Metadata &amp; Runtime</classification>
          <product>OE-Core</product>
          <component>core</component>
          <version>unspecified</version>
          <rep_platform>x86</rep_platform>
          <op_sys>x86_64</op_sys>
          <bug_status>RESOLVED</bug_status>
          <resolution>WORKSFORME</resolution>
          
          
          <bug_file_loc></bug_file_loc>
          <status_whiteboard></status_whiteboard>
          <keywords></keywords>
          <priority>Medium</priority>
          <bug_severity>normal</bug_severity>
          <target_milestone>1.2</target_milestone>
          
          <blocked>1579</blocked>
          <everconfirmed>1</everconfirmed>
          <reporter name="Nitin Kamble">nitin.a.kamble</reporter>
          <assigned_to name="Nitin Kamble">nitin.a.kamble</assigned_to>
          <cc>hjl.tools</cc>
    
    <cc>meta.mr.watcher</cc>
    
    <cc>meta.watcher</cc>
          
          
          <cf_os>---</cf_os>
          <cf_regression_type>---</cf_regression_type>
          
          <cf_docchange>---</cf_docchange>

      

      

      

          <comment_sort_order>oldest_to_newest</comment_sort_order>  
          <long_desc isprivate="0" >
    <commentid>15773</commentid>
    <comment_count>0</comment_count>
    <who name="Nitin Kamble">nitin.a.kamble</who>
    <bug_when>2011-08-25 14:28:15 +0000</bug_when>
    <thetext>ERROR: Logfile of failure stored in: /disk0/pokybuild/build-multilib-x32-qemu/tmp/work/x86_64-x32-poky-linux-gnux32/systemtap-1.4+git1+4ab3a1863bf4f472acae7a809bf2b38d91658aa8-r4/temp/log.do_compile.7547
Log data follows:
| DEBUG: SITE files [&apos;endian-little&apos;, &apos;common-linux&apos;, &apos;common-glibc&apos;, &apos;bit-32&apos;, &apos;ix86-common&apos;, &apos;x86_64-linux-gnux32&apos;, &apos;common&apos;]
| NOTE: make -j 16
| /bin/sh ./git_version.sh -k -s . -o git_version.h
| fatal: ref HEAD is not a symbolic ref
| git_version.sh: Output is unchanged, keeping git_version.h
| make  all-recursive
| make[1]: Entering directory `/disk0/pokybuild/build-multilib-x32-qemu/tmp/work/x86_64-x32-poky-linux-gnux32/systemtap-1.4+git1+4ab3a1863bf4f472acae7a809bf2b38d91658aa8-r4/git&apos;
| Making all in .
| make[2]: Entering directory `/disk0/pokybuild/build-multilib-x32-qemu/tmp/work/x86_64-x32-poky-linux-gnux32/systemtap-1.4+git1+4ab3a1863bf4f472acae7a809bf2b38d91658aa8-r4/git&apos;
| ccache x86_64-poky-linux-gnux32-g++   -mx32  --sysroot=/disk0/pokybuild/build-multilib-x32-qemu/tmp/sysroots/qemux86-64 -DHAVE_CONFIG_H -I.  -DBINDIR=&apos;&quot;/usr/bin&quot;&apos; -DSYSCONFDIR=&apos;&quot;/etc&quot;&apos; -DPKGDATADIR=&apos;&quot;/usr/share/systemtap&quot;&apos; -DPKGLIBDIR=&apos;&quot;/usr/libexec/systemtap&quot;&apos; -I./includes -I./includes/sys -DSTAP_SDT_V2     -Wall -Werror   -O2 -pipe -g -feliminate-unused-debug-types -fpermissive -fvisibility-inlines-hidden -Werror -fstack-protector-all -D_FORTIFY_SOURCE=2 -MT stap-session.o -MD -MP -MF .deps/stap-session.Tpo -c -o stap-session.o `test -f &apos;session.cxx&apos; || echo &apos;./&apos;`session.cxx
| The script example index is outdated, run
|     cd ./testsuite/systemtap.examples &amp;&amp; \
|     perl examples-index-gen.pl
| to regenerate it.
| session.cxx: In member function &apos;void systemtap_session::register_library_aliases()&apos;:
| session.cxx:1116:32: error: redeclaration of &apos;match_node* n&apos;
| session.cxx:1113:29: error: &apos;unsigned int n&apos; previously declared here
| make[2]: *** [stap-session.o] Error 1
| make[2]: Leaving directory `/disk0/pokybuild/build-multilib-x32-qemu/tmp/work/x86_64-x32-poky-linux-gnux32/systemtap-1.4+git1+4ab3a1863bf4f472acae7a809bf2b38d91658aa8-r4/git&apos;
| make[1]: *** [all-recursive] Error 1
| make[1]: Leaving directory `/disk0/pokybuild/build-multilib-x32-qemu/tmp/work/x86_64-x32-poky-linux-gnux32/systemtap-1.4+git1+4ab3a1863bf4f472acae7a809bf2b38d91658aa8-r4/git&apos;
| make: *** [all] Error 2
| ERROR: oe_runmake failed
| ERROR: Function &apos;do_compile&apos; failed (see /disk0/pokybuild/build-multilib-x32-qemu/tmp/work/x86_64-x32-poky-linux-gnux32/systemtap-1.4+git1+4ab3a1863bf4f472acae7a809bf2b38d91658aa8-r4/temp/log.do_compile.7547 for further information)
NOTE: package systemtap-1.4+git1+4ab3a1863bf4f472acae7a809bf2b38d91658aa8-r4: task do_compile: Failed</thetext>
  </long_desc><long_desc isprivate="0" >
    <commentid>17455</commentid>
    <comment_count>1</comment_count>
    <who name="Nitin Kamble">nitin.a.kamble</who>
    <bug_when>2011-12-01 13:42:36 +0000</bug_when>
    <thetext>THis issue does not happen on the latest x32 layer
Nitin</thetext>
  </long_desc>
      
      

    </bug>

</bugzilla>