<?xml version="1.0" encoding="UTF-8" standalone="yes" ?>
<!DOCTYPE bugzilla SYSTEM "https://bugzilla.yoctoproject.org/page.cgi?id=bugzilla.dtd">

<bugzilla version="5.0.6"
          urlbase="https://bugzilla.yoctoproject.org/"
          
          maintainer="it-coreprojects-helpdesk@linuxfoundation.org"
>

    <bug>
          <bug_id>1409</bug_id>
          
          <creation_ts>2011-08-25 14:32:29 +0000</creation_ts>
          <short_desc>x32: lttng-ust build fails</short_desc>
          <delta_ts>2011-12-01 14:35:12 +0000</delta_ts>
          <reporter_accessible>1</reporter_accessible>
          <cclist_accessible>1</cclist_accessible>
          <classification_id>7</classification_id>
          <classification>Build System, Metadata &amp; Runtime</classification>
          <product>OE-Core</product>
          <component>core</component>
          <version>unspecified</version>
          <rep_platform>x86</rep_platform>
          <op_sys>x86_64</op_sys>
          <bug_status>RESOLVED</bug_status>
          <resolution>WORKSFORME</resolution>
          
          
          <bug_file_loc></bug_file_loc>
          <status_whiteboard></status_whiteboard>
          <keywords></keywords>
          <priority>Medium</priority>
          <bug_severity>normal</bug_severity>
          <target_milestone>1.2</target_milestone>
          
          <blocked>1579</blocked>
          <everconfirmed>1</everconfirmed>
          <reporter name="Nitin Kamble">nitin.a.kamble</reporter>
          <assigned_to name="Nitin Kamble">nitin.a.kamble</assigned_to>
          <cc>hjl.tools</cc>
    
    <cc>meta.mr.watcher</cc>
    
    <cc>meta.watcher</cc>
          
          
          <cf_os>---</cf_os>
          <cf_regression_type>---</cf_regression_type>
          
          <cf_docchange>---</cf_docchange>

      

      

      

          <comment_sort_order>oldest_to_newest</comment_sort_order>  
          <long_desc isprivate="0" >
    <commentid>15774</commentid>
    <comment_count>0</comment_count>
    <who name="Nitin Kamble">nitin.a.kamble</who>
    <bug_when>2011-08-25 14:32:29 +0000</bug_when>
    <thetext>ERROR: Function &apos;do_install&apos; failed (see /disk0/pokybuild/build-multilib-x32-qemu/tmp/work/x86_64-x32-poky-linux-gnux32/lttng-ust-0.15-r2/temp/log.do_install.7456 for further information)
ERROR: Logfile of failure stored in: /disk0/pokybuild/build-multilib-x32-qemu/tmp/work/x86_64-x32-poky-linux-gnux32/lttng-ust-0.15-r2/temp/log.do_install.7456
Log data follows:
| DEBUG: SITE files [&apos;endian-little&apos;, &apos;common-linux&apos;, &apos;common-glibc&apos;, &apos;bit-32&apos;, &apos;ix86-common&apos;, &apos;x86_64-linux-gnux32&apos;, &apos;common&apos;]
| NOTE: make DESTDIR=/disk0/pokybuild/build-multilib-x32-qemu/tmp/work/x86_64-x32-poky-linux-gnux32/lttng-ust-0.15-r2/image install
| Making install in snprintf
| make[1]: Entering directory `/disk0/pokybuild/build-multilib-x32-qemu/tmp/work/x86_64-x32-poky-linux-gnux32/lttng-ust-0.15-r2/ust-0.15/snprintf&apos;
| make[2]: Entering directory `/disk0/pokybuild/build-multilib-x32-qemu/tmp/work/x86_64-x32-poky-linux-gnux32/lttng-ust-0.15-r2/ust-0.15/snprintf&apos;
| make[2]: Nothing to be done for `install-exec-am&apos;.
| make[2]: Nothing to be done for `install-data-am&apos;.
| make[2]: Leaving directory `/disk0/pokybuild/build-multilib-x32-qemu/tmp/work/x86_64-x32-poky-linux-gnux32/lttng-ust-0.15-r2/ust-0.15/snprintf&apos;
| make[1]: Leaving directory `/disk0/pokybuild/build-multilib-x32-qemu/tmp/work/x86_64-x32-poky-linux-gnux32/lttng-ust-0.15-r2/ust-0.15/snprintf&apos;
| Making install in libustcomm
| make[1]: Entering directory `/disk0/pokybuild/build-multilib-x32-qemu/tmp/work/x86_64-x32-poky-linux-gnux32/lttng-ust-0.15-r2/ust-0.15/libustcomm&apos;
| make[2]: Entering directory `/disk0/pokybuild/build-multilib-x32-qemu/tmp/work/x86_64-x32-poky-linux-gnux32/lttng-ust-0.15-r2/ust-0.15/libustcomm&apos;
| make[2]: Nothing to be done for `install-exec-am&apos;.
| make[2]: Nothing to be done for `install-data-am&apos;.
| make[2]: Leaving directory `/disk0/pokybuild/build-multilib-x32-qemu/tmp/work/x86_64-x32-poky-linux-gnux32/lttng-ust-0.15-r2/ust-0.15/libustcomm&apos;
| make[1]: Leaving directory `/disk0/pokybuild/build-multilib-x32-qemu/tmp/work/x86_64-x32-poky-linux-gnux32/lttng-ust-0.15-r2/ust-0.15/libustcomm&apos;
| Making install in libustctl
| make[1]: Entering directory `/disk0/pokybuild/build-multilib-x32-qemu/tmp/work/x86_64-x32-poky-linux-gnux32/lttng-ust-0.15-r2/ust-0.15/libustctl&apos;
| make[2]: Entering directory `/disk0/pokybuild/build-multilib-x32-qemu/tmp/work/x86_64-x32-poky-linux-gnux32/lttng-ust-0.15-r2/ust-0.15/libustctl&apos;
| test -z &quot;/usr/lib&quot; || /bin/mkdir -p &quot;/disk0/pokybuild/build-multilib-x32-qemu/tmp/work/x86_64-x32-poky-linux-gnux32/lttng-ust-0.15-r2/image/usr/lib&quot;
|  /bin/sh ../x86_64-poky-linux-gnux32-libtool   --mode=install /usr/bin/install -c   libustctl.la &apos;/disk0/pokybuild/build-multilib-x32-qemu/tmp/work/x86_64-x32-poky-linux-gnux32/lttng-ust-0.15-r2/image/usr/lib&apos;
| x86_64-poky-linux-gnux32-libtool: install: /usr/bin/install -c .libs/libustctl.so.0.0.0 /disk0/pokybuild/build-multilib-x32-qemu/tmp/work/x86_64-x32-poky-linux-gnux32/lttng-ust-0.15-r2/image/usr/lib/libustctl.so.0.0.0
| x86_64-poky-linux-gnux32-libtool: install: (cd /disk0/pokybuild/build-multilib-x32-qemu/tmp/work/x86_64-x32-poky-linux-gnux32/lttng-ust-0.15-r2/image/usr/lib &amp;&amp; { ln -s -f libustctl.so.0.0.0 libustctl.so.0 || { rm -f libustctl.so.0 &amp;&amp; ln -s libustctl.so.0.0.0 libustctl.so.0; }; })
| x86_64-poky-linux-gnux32-libtool: install: (cd /disk0/pokybuild/build-multilib-x32-qemu/tmp/work/x86_64-x32-poky-linux-gnux32/lttng-ust-0.15-r2/image/usr/lib &amp;&amp; { ln -s -f libustctl.so.0.0.0 libustctl.so || { rm -f libustctl.so &amp;&amp; ln -s libustctl.so.0.0.0 libustctl.so; }; })
| x86_64-poky-linux-gnux32-libtool: install: /usr/bin/install -c .libs/libustctl.lai /disk0/pokybuild/build-multilib-x32-qemu/tmp/work/x86_64-x32-poky-linux-gnux32/lttng-ust-0.15-r2/image/usr/lib/libustctl.la
| x86_64-poky-linux-gnux32-libtool: install: /usr/bin/install -c .libs/libustctl.a /disk0/pokybuild/build-multilib-x32-qemu/tmp/work/x86_64-x32-poky-linux-gnux32/lttng-ust-0.15-r2/image/usr/lib/libustctl.a
| x86_64-poky-linux-gnux32-libtool: install: chmod 644 /disk0/pokybuild/build-multilib-x32-qemu/tmp/work/x86_64-x32-poky-linux-gnux32/lttng-ust-0.15-r2/image/usr/lib/libustctl.a
| x86_64-poky-linux-gnux32-libtool: install: x86_64-poky-linux-gnux32-ranlib /disk0/pokybuild/build-multilib-x32-qemu/tmp/work/x86_64-x32-poky-linux-gnux32/lttng-ust-0.15-r2/image/usr/lib/libustctl.a
| x86_64-poky-linux-gnux32-libtool: install: warning: remember to run `x86_64-poky-linux-gnux32-libtool --finish /usr/lib&apos;
| make[2]: Nothing to be done for `install-data-am&apos;.
| make[2]: Leaving directory `/disk0/pokybuild/build-multilib-x32-qemu/tmp/work/x86_64-x32-poky-linux-gnux32/lttng-ust-0.15-r2/ust-0.15/libustctl&apos;
| make[1]: Leaving directory `/disk0/pokybuild/build-multilib-x32-qemu/tmp/work/x86_64-x32-poky-linux-gnux32/lttng-ust-0.15-r2/ust-0.15/libustctl&apos;
| Making install in libust
| make[1]: Entering directory `/disk0/pokybuild/build-multilib-x32-qemu/tmp/work/x86_64-x32-poky-linux-gnux32/lttng-ust-0.15-r2/ust-0.15/libust&apos;
| make[2]: Entering directory `/disk0/pokybuild/build-multilib-x32-qemu/tmp/work/x86_64-x32-poky-linux-gnux32/lttng-ust-0.15-r2/ust-0.15/libust&apos;
| test -z &quot;/usr/lib&quot; || /bin/mkdir -p &quot;/disk0/pokybuild/build-multilib-x32-qemu/tmp/work/x86_64-x32-poky-linux-gnux32/lttng-ust-0.15-r2/image/usr/lib&quot;
|  /bin/sh ../x86_64-poky-linux-gnux32-libtool   --mode=install /usr/bin/install -c   libust.la &apos;/disk0/pokybuild/build-multilib-x32-qemu/tmp/work/x86_64-x32-poky-linux-gnux32/lttng-ust-0.15-r2/image/usr/lib&apos;
| x86_64-poky-linux-gnux32-libtool: install: /usr/bin/install -c .libs/libust.so.0.0.0 /disk0/pokybuild/build-multilib-x32-qemu/tmp/work/x86_64-x32-poky-linux-gnux32/lttng-ust-0.15-r2/image/usr/lib/libust.so.0.0.0
| x86_64-poky-linux-gnux32-libtool: install: (cd /disk0/pokybuild/build-multilib-x32-qemu/tmp/work/x86_64-x32-poky-linux-gnux32/lttng-ust-0.15-r2/image/usr/lib &amp;&amp; { ln -s -f libust.so.0.0.0 libust.so.0 || { rm -f libust.so.0 &amp;&amp; ln -s libust.so.0.0.0 libust.so.0; }; })
| x86_64-poky-linux-gnux32-libtool: install: (cd /disk0/pokybuild/build-multilib-x32-qemu/tmp/work/x86_64-x32-poky-linux-gnux32/lttng-ust-0.15-r2/image/usr/lib &amp;&amp; { ln -s -f libust.so.0.0.0 libust.so || { rm -f libust.so &amp;&amp; ln -s libust.so.0.0.0 libust.so; }; })
| x86_64-poky-linux-gnux32-libtool: install: /usr/bin/install -c .libs/libust.lai /disk0/pokybuild/build-multilib-x32-qemu/tmp/work/x86_64-x32-poky-linux-gnux32/lttng-ust-0.15-r2/image/usr/lib/libust.la
| x86_64-poky-linux-gnux32-libtool: install: /usr/bin/install -c .libs/libust.a /disk0/pokybuild/build-multilib-x32-qemu/tmp/work/x86_64-x32-poky-linux-gnux32/lttng-ust-0.15-r2/image/usr/lib/libust.a
| x86_64-poky-linux-gnux32-libtool: install: chmod 644 /disk0/pokybuild/build-multilib-x32-qemu/tmp/work/x86_64-x32-poky-linux-gnux32/lttng-ust-0.15-r2/image/usr/lib/libust.a
| x86_64-poky-linux-gnux32-libtool: install: x86_64-poky-linux-gnux32-ranlib /disk0/pokybuild/build-multilib-x32-qemu/tmp/work/x86_64-x32-poky-linux-gnux32/lttng-ust-0.15-r2/image/usr/lib/libust.a
| x86_64-poky-linux-gnux32-libtool: install: warning: remember to run `x86_64-poky-linux-gnux32-libtool --finish /usr/lib&apos;
| make[2]: Nothing to be done for `install-data-am&apos;.
| make[2]: Leaving directory `/disk0/pokybuild/build-multilib-x32-qemu/tmp/work/x86_64-x32-poky-linux-gnux32/lttng-ust-0.15-r2/ust-0.15/libust&apos;
| make[1]: Leaving directory `/disk0/pokybuild/build-multilib-x32-qemu/tmp/work/x86_64-x32-poky-linux-gnux32/lttng-ust-0.15-r2/ust-0.15/libust&apos;
| Making install in .
| make[1]: Entering directory `/disk0/pokybuild/build-multilib-x32-qemu/tmp/work/x86_64-x32-poky-linux-gnux32/lttng-ust-0.15-r2/ust-0.15&apos;
| make[2]: Entering directory `/disk0/pokybuild/build-multilib-x32-qemu/tmp/work/x86_64-x32-poky-linux-gnux32/lttng-ust-0.15-r2/ust-0.15&apos;
| test -z &quot;/usr/bin&quot; || /bin/mkdir -p &quot;/disk0/pokybuild/build-multilib-x32-qemu/tmp/work/x86_64-x32-poky-linux-gnux32/lttng-ust-0.15-r2/image/usr/bin&quot;
|  /usr/bin/install -c usttrace &apos;/disk0/pokybuild/build-multilib-x32-qemu/tmp/work/x86_64-x32-poky-linux-gnux32/lttng-ust-0.15-r2/image/usr/bin&apos;
| test -z &quot;/usr/lib&quot; || /bin/mkdir -p &quot;/disk0/pokybuild/build-multilib-x32-qemu/tmp/work/x86_64-x32-poky-linux-gnux32/lttng-ust-0.15-r2/image/usr/lib&quot;
|  /usr/bin/install -c -m 644 libust.so libust-initializer.o &apos;/disk0/pokybuild/build-multilib-x32-qemu/tmp/work/x86_64-x32-poky-linux-gnux32/lttng-ust-0.15-r2/image/usr/lib&apos;
| test -z &quot;/usr/lib/pkgconfig&quot; || /bin/mkdir -p &quot;/disk0/pokybuild/build-multilib-x32-qemu/tmp/work/x86_64-x32-poky-linux-gnux32/lttng-ust-0.15-r2/image/usr/lib/pkgconfig&quot;
|  /usr/bin/install -c -m 644 ust.pc &apos;/disk0/pokybuild/build-multilib-x32-qemu/tmp/work/x86_64-x32-poky-linux-gnux32/lttng-ust-0.15-r2/image/usr/lib/pkgconfig&apos;
| make[2]: Leaving directory `/disk0/pokybuild/build-multilib-x32-qemu/tmp/work/x86_64-x32-poky-linux-gnux32/lttng-ust-0.15-r2/ust-0.15&apos;
| make[1]: Leaving directory `/disk0/pokybuild/build-multilib-x32-qemu/tmp/work/x86_64-x32-poky-linux-gnux32/lttng-ust-0.15-r2/ust-0.15&apos;
| Making install in tests
| make[1]: Entering directory `/disk0/pokybuild/build-multilib-x32-qemu/tmp/work/x86_64-x32-poky-linux-gnux32/lttng-ust-0.15-r2/ust-0.15/tests&apos;
| Making install in .
| make[2]: Entering directory `/disk0/pokybuild/build-multilib-x32-qemu/tmp/work/x86_64-x32-poky-linux-gnux32/lttng-ust-0.15-r2/ust-0.15/tests&apos;
| make[3]: Entering directory `/disk0/pokybuild/build-multilib-x32-qemu/tmp/work/x86_64-x32-poky-linux-gnux32/lttng-ust-0.15-r2/ust-0.15/tests&apos;
| make[3]: Nothing to be done for `install-exec-am&apos;.
| make[3]: Nothing to be done for `install-data-am&apos;.
| make[3]: Leaving directory `/disk0/pokybuild/build-multilib-x32-qemu/tmp/work/x86_64-x32-poky-linux-gnux32/lttng-ust-0.15-r2/ust-0.15/tests&apos;
| make[2]: Leaving directory `/disk0/pokybuild/build-multilib-x32-qemu/tmp/work/x86_64-x32-poky-linux-gnux32/lttng-ust-0.15-r2/ust-0.15/tests&apos;
| Making install in hello
| make[2]: Entering directory `/disk0/pokybuild/build-multilib-x32-qemu/tmp/work/x86_64-x32-poky-linux-gnux32/lttng-ust-0.15-r2/ust-0.15/tests/hello&apos;
| make[3]: Entering directory `/disk0/pokybuild/build-multilib-x32-qemu/tmp/work/x86_64-x32-poky-linux-gnux32/lttng-ust-0.15-r2/ust-0.15/tests/hello&apos;
| make[3]: Nothing to be done for `install-exec-am&apos;.
| make[3]: Nothing to be done for `install-data-am&apos;.
| make[3]: Leaving directory `/disk0/pokybuild/build-multilib-x32-qemu/tmp/work/x86_64-x32-poky-linux-gnux32/lttng-ust-0.15-r2/ust-0.15/tests/hello&apos;
| make[2]: Leaving directory `/disk0/pokybuild/build-multilib-x32-qemu/tmp/work/x86_64-x32-poky-linux-gnux32/lttng-ust-0.15-r2/ust-0.15/tests/hello&apos;
| Making install in hello2
| make[2]: Entering directory `/disk0/pokybuild/build-multilib-x32-qemu/tmp/work/x86_64-x32-poky-linux-gnux32/lttng-ust-0.15-r2/ust-0.15/tests/hello2&apos;
| make[3]: Entering directory `/disk0/pokybuild/build-multilib-x32-qemu/tmp/work/x86_64-x32-poky-linux-gnux32/lttng-ust-0.15-r2/ust-0.15/tests/hello2&apos;
| make[3]: Nothing to be done for `install-exec-am&apos;.
| make[3]: Nothing to be done for `install-data-am&apos;.
| make[3]: Leaving directory `/disk0/pokybuild/build-multilib-x32-qemu/tmp/work/x86_64-x32-poky-linux-gnux32/lttng-ust-0.15-r2/ust-0.15/tests/hello2&apos;
| make[2]: Leaving directory `/disk0/pokybuild/build-multilib-x32-qemu/tmp/work/x86_64-x32-poky-linux-gnux32/lttng-ust-0.15-r2/ust-0.15/tests/hello2&apos;
| Making install in basic
| make[2]: Entering directory `/disk0/pokybuild/build-multilib-x32-qemu/tmp/work/x86_64-x32-poky-linux-gnux32/lttng-ust-0.15-r2/ust-0.15/tests/basic&apos;
| make[3]: Entering directory `/disk0/pokybuild/build-multilib-x32-qemu/tmp/work/x86_64-x32-poky-linux-gnux32/lttng-ust-0.15-r2/ust-0.15/tests/basic&apos;
| make[3]: Nothing to be done for `install-exec-am&apos;.
| make[3]: Nothing to be done for `install-data-am&apos;.
| make[3]: Leaving directory `/disk0/pokybuild/build-multilib-x32-qemu/tmp/work/x86_64-x32-poky-linux-gnux32/lttng-ust-0.15-r2/ust-0.15/tests/basic&apos;
| make[2]: Leaving directory `/disk0/pokybuild/build-multilib-x32-qemu/tmp/work/x86_64-x32-poky-linux-gnux32/lttng-ust-0.15-r2/ust-0.15/tests/basic&apos;
| Making install in basic_long
| make[2]: Entering directory `/disk0/pokybuild/build-multilib-x32-qemu/tmp/work/x86_64-x32-poky-linux-gnux32/lttng-ust-0.15-r2/ust-0.15/tests/basic_long&apos;
| make[3]: Entering directory `/disk0/pokybuild/build-multilib-x32-qemu/tmp/work/x86_64-x32-poky-linux-gnux32/lttng-ust-0.15-r2/ust-0.15/tests/basic_long&apos;
| make[3]: Nothing to be done for `install-exec-am&apos;.
| make[3]: Nothing to be done for `install-data-am&apos;.
| make[3]: Leaving directory `/disk0/pokybuild/build-multilib-x32-qemu/tmp/work/x86_64-x32-poky-linux-gnux32/lttng-ust-0.15-r2/ust-0.15/tests/basic_long&apos;
| make[2]: Leaving directory `/disk0/pokybuild/build-multilib-x32-qemu/tmp/work/x86_64-x32-poky-linux-gnux32/lttng-ust-0.15-r2/ust-0.15/tests/basic_long&apos;
| Making install in fork
| make[2]: Entering directory `/disk0/pokybuild/build-multilib-x32-qemu/tmp/work/x86_64-x32-poky-linux-gnux32/lttng-ust-0.15-r2/ust-0.15/tests/fork&apos;
| make[3]: Entering directory `/disk0/pokybuild/build-multilib-x32-qemu/tmp/work/x86_64-x32-poky-linux-gnux32/lttng-ust-0.15-r2/ust-0.15/tests/fork&apos;
| make[3]: Nothing to be done for `install-exec-am&apos;.
| make[3]: Nothing to be done for `install-data-am&apos;.
| make[3]: Leaving directory `/disk0/pokybuild/build-multilib-x32-qemu/tmp/work/x86_64-x32-poky-linux-gnux32/lttng-ust-0.15-r2/ust-0.15/tests/fork&apos;
| make[2]: Leaving directory `/disk0/pokybuild/build-multilib-x32-qemu/tmp/work/x86_64-x32-poky-linux-gnux32/lttng-ust-0.15-r2/ust-0.15/tests/fork&apos;
| Making install in simple_include
| make[2]: Entering directory `/disk0/pokybuild/build-multilib-x32-qemu/tmp/work/x86_64-x32-poky-linux-gnux32/lttng-ust-0.15-r2/ust-0.15/tests/simple_include&apos;
| make[3]: Entering directory `/disk0/pokybuild/build-multilib-x32-qemu/tmp/work/x86_64-x32-poky-linux-gnux32/lttng-ust-0.15-r2/ust-0.15/tests/simple_include&apos;
| make[3]: Nothing to be done for `install-exec-am&apos;.
| make[3]: Nothing to be done for `install-data-am&apos;.
| make[3]: Leaving directory `/disk0/pokybuild/build-multilib-x32-qemu/tmp/work/x86_64-x32-poky-linux-gnux32/lttng-ust-0.15-r2/ust-0.15/tests/simple_include&apos;
| make[2]: Leaving directory `/disk0/pokybuild/build-multilib-x32-qemu/tmp/work/x86_64-x32-poky-linux-gnux32/lttng-ust-0.15-r2/ust-0.15/tests/simple_include&apos;
| Making install in snprintf
| make[2]: Entering directory `/disk0/pokybuild/build-multilib-x32-qemu/tmp/work/x86_64-x32-poky-linux-gnux32/lttng-ust-0.15-r2/ust-0.15/tests/snprintf&apos;
| make[3]: Entering directory `/disk0/pokybuild/build-multilib-x32-qemu/tmp/work/x86_64-x32-poky-linux-gnux32/lttng-ust-0.15-r2/ust-0.15/tests/snprintf&apos;
| make[3]: Nothing to be done for `install-exec-am&apos;.
| make[3]: Nothing to be done for `install-data-am&apos;.
| make[3]: Leaving directory `/disk0/pokybuild/build-multilib-x32-qemu/tmp/work/x86_64-x32-poky-linux-gnux32/lttng-ust-0.15-r2/ust-0.15/tests/snprintf&apos;
| make[2]: Leaving directory `/disk0/pokybuild/build-multilib-x32-qemu/tmp/work/x86_64-x32-poky-linux-gnux32/lttng-ust-0.15-r2/ust-0.15/tests/snprintf&apos;
| Making install in test-nevents
| make[2]: Entering directory `/disk0/pokybuild/build-multilib-x32-qemu/tmp/work/x86_64-x32-poky-linux-gnux32/lttng-ust-0.15-r2/ust-0.15/tests/test-nevents&apos;
| make[3]: Entering directory `/disk0/pokybuild/build-multilib-x32-qemu/tmp/work/x86_64-x32-poky-linux-gnux32/lttng-ust-0.15-r2/ust-0.15/tests/test-nevents&apos;
| make[3]: Nothing to be done for `install-exec-am&apos;.
| make[3]: Nothing to be done for `install-data-am&apos;.
| make[3]: Leaving directory `/disk0/pokybuild/build-multilib-x32-qemu/tmp/work/x86_64-x32-poky-linux-gnux32/lttng-ust-0.15-r2/ust-0.15/tests/test-nevents&apos;
| make[2]: Leaving directory `/disk0/pokybuild/build-multilib-x32-qemu/tmp/work/x86_64-x32-poky-linux-gnux32/lttng-ust-0.15-r2/ust-0.15/tests/test-nevents&apos;
| Making install in test-libustinstr-malloc
| make[2]: Entering directory `/disk0/pokybuild/build-multilib-x32-qemu/tmp/work/x86_64-x32-poky-linux-gnux32/lttng-ust-0.15-r2/ust-0.15/tests/test-libustinstr-malloc&apos;
| make[3]: Entering directory `/disk0/pokybuild/build-multilib-x32-qemu/tmp/work/x86_64-x32-poky-linux-gnux32/lttng-ust-0.15-r2/ust-0.15/tests/test-libustinstr-malloc&apos;
| make[3]: Nothing to be done for `install-exec-am&apos;.
| make[3]: Nothing to be done for `install-data-am&apos;.
| make[3]: Leaving directory `/disk0/pokybuild/build-multilib-x32-qemu/tmp/work/x86_64-x32-poky-linux-gnux32/lttng-ust-0.15-r2/ust-0.15/tests/test-libustinstr-malloc&apos;
| make[2]: Leaving directory `/disk0/pokybuild/build-multilib-x32-qemu/tmp/work/x86_64-x32-poky-linux-gnux32/lttng-ust-0.15-r2/ust-0.15/tests/test-libustinstr-malloc&apos;
| Making install in dlopen
| make[2]: Entering directory `/disk0/pokybuild/build-multilib-x32-qemu/tmp/work/x86_64-x32-poky-linux-gnux32/lttng-ust-0.15-r2/ust-0.15/tests/dlopen&apos;
| make[3]: Entering directory `/disk0/pokybuild/build-multilib-x32-qemu/tmp/work/x86_64-x32-poky-linux-gnux32/lttng-ust-0.15-r2/ust-0.15/tests/dlopen&apos;
| make[3]: Nothing to be done for `install-exec-am&apos;.
| make[3]: Nothing to be done for `install-data-am&apos;.
| make[3]: Leaving directory `/disk0/pokybuild/build-multilib-x32-qemu/tmp/work/x86_64-x32-poky-linux-gnux32/lttng-ust-0.15-r2/ust-0.15/tests/dlopen&apos;
| make[2]: Leaving directory `/disk0/pokybuild/build-multilib-x32-qemu/tmp/work/x86_64-x32-poky-linux-gnux32/lttng-ust-0.15-r2/ust-0.15/tests/dlopen&apos;
| Making install in same_line_marker
| make[2]: Entering directory `/disk0/pokybuild/build-multilib-x32-qemu/tmp/work/x86_64-x32-poky-linux-gnux32/lttng-ust-0.15-r2/ust-0.15/tests/same_line_marker&apos;
| make[3]: Entering directory `/disk0/pokybuild/build-multilib-x32-qemu/tmp/work/x86_64-x32-poky-linux-gnux32/lttng-ust-0.15-r2/ust-0.15/tests/same_line_marker&apos;
| make[3]: Nothing to be done for `install-exec-am&apos;.
| make[3]: Nothing to be done for `install-data-am&apos;.
| make[3]: Leaving directory `/disk0/pokybuild/build-multilib-x32-qemu/tmp/work/x86_64-x32-poky-linux-gnux32/lttng-ust-0.15-r2/ust-0.15/tests/same_line_marker&apos;
| make[2]: Leaving directory `/disk0/pokybuild/build-multilib-x32-qemu/tmp/work/x86_64-x32-poky-linux-gnux32/lttng-ust-0.15-r2/ust-0.15/tests/same_line_marker&apos;
| Making install in trace_event
| make[2]: Entering directory `/disk0/pokybuild/build-multilib-x32-qemu/tmp/work/x86_64-x32-poky-linux-gnux32/lttng-ust-0.15-r2/ust-0.15/tests/trace_event&apos;
| make[3]: Entering directory `/disk0/pokybuild/build-multilib-x32-qemu/tmp/work/x86_64-x32-poky-linux-gnux32/lttng-ust-0.15-r2/ust-0.15/tests/trace_event&apos;
| make[3]: Nothing to be done for `install-exec-am&apos;.
| make[3]: Nothing to be done for `install-data-am&apos;.
| make[3]: Leaving directory `/disk0/pokybuild/build-multilib-x32-qemu/tmp/work/x86_64-x32-poky-linux-gnux32/lttng-ust-0.15-r2/ust-0.15/tests/trace_event&apos;
| make[2]: Leaving directory `/disk0/pokybuild/build-multilib-x32-qemu/tmp/work/x86_64-x32-poky-linux-gnux32/lttng-ust-0.15-r2/ust-0.15/tests/trace_event&apos;
| Making install in register_test
| make[2]: Entering directory `/disk0/pokybuild/build-multilib-x32-qemu/tmp/work/x86_64-x32-poky-linux-gnux32/lttng-ust-0.15-r2/ust-0.15/tests/register_test&apos;
| make[3]: Entering directory `/disk0/pokybuild/build-multilib-x32-qemu/tmp/work/x86_64-x32-poky-linux-gnux32/lttng-ust-0.15-r2/ust-0.15/tests/register_test&apos;
| make[3]: Nothing to be done for `install-exec-am&apos;.
| make[3]: Nothing to be done for `install-data-am&apos;.
| make[3]: Leaving directory `/disk0/pokybuild/build-multilib-x32-qemu/tmp/work/x86_64-x32-poky-linux-gnux32/lttng-ust-0.15-r2/ust-0.15/tests/register_test&apos;
| make[2]: Leaving directory `/disk0/pokybuild/build-multilib-x32-qemu/tmp/work/x86_64-x32-poky-linux-gnux32/lttng-ust-0.15-r2/ust-0.15/tests/register_test&apos;
| Making install in tracepoint
| make[2]: Entering directory `/disk0/pokybuild/build-multilib-x32-qemu/tmp/work/x86_64-x32-poky-linux-gnux32/lttng-ust-0.15-r2/ust-0.15/tests/tracepoint&apos;
| Making install in benchmark
| make[3]: Entering directory `/disk0/pokybuild/build-multilib-x32-qemu/tmp/work/x86_64-x32-poky-linux-gnux32/lttng-ust-0.15-r2/ust-0.15/tests/tracepoint/benchmark&apos;
| make[4]: Entering directory `/disk0/pokybuild/build-multilib-x32-qemu/tmp/work/x86_64-x32-poky-linux-gnux32/lttng-ust-0.15-r2/ust-0.15/tests/tracepoint/benchmark&apos;
| make[4]: Nothing to be done for `install-exec-am&apos;.
| make[4]: Nothing to be done for `install-data-am&apos;.
| make[4]: Leaving directory `/disk0/pokybuild/build-multilib-x32-qemu/tmp/work/x86_64-x32-poky-linux-gnux32/lttng-ust-0.15-r2/ust-0.15/tests/tracepoint/benchmark&apos;
| make[3]: Leaving directory `/disk0/pokybuild/build-multilib-x32-qemu/tmp/work/x86_64-x32-poky-linux-gnux32/lttng-ust-0.15-r2/ust-0.15/tests/tracepoint/benchmark&apos;
| make[3]: Entering directory `/disk0/pokybuild/build-multilib-x32-qemu/tmp/work/x86_64-x32-poky-linux-gnux32/lttng-ust-0.15-r2/ust-0.15/tests/tracepoint&apos;
| make[4]: Entering directory `/disk0/pokybuild/build-multilib-x32-qemu/tmp/work/x86_64-x32-poky-linux-gnux32/lttng-ust-0.15-r2/ust-0.15/tests/tracepoint&apos;
| make[4]: Nothing to be done for `install-exec-am&apos;.
| make[4]: Nothing to be done for `install-data-am&apos;.
| make[4]: Leaving directory `/disk0/pokybuild/build-multilib-x32-qemu/tmp/work/x86_64-x32-poky-linux-gnux32/lttng-ust-0.15-r2/ust-0.15/tests/tracepoint&apos;
| make[3]: Leaving directory `/disk0/pokybuild/build-multilib-x32-qemu/tmp/work/x86_64-x32-poky-linux-gnux32/lttng-ust-0.15-r2/ust-0.15/tests/tracepoint&apos;
| make[2]: Leaving directory `/disk0/pokybuild/build-multilib-x32-qemu/tmp/work/x86_64-x32-poky-linux-gnux32/lttng-ust-0.15-r2/ust-0.15/tests/tracepoint&apos;
| Making install in libustctl_function_tests
| make[2]: Entering directory `/disk0/pokybuild/build-multilib-x32-qemu/tmp/work/x86_64-x32-poky-linux-gnux32/lttng-ust-0.15-r2/ust-0.15/tests/libustctl_function_tests&apos;
| make[3]: Entering directory `/disk0/pokybuild/build-multilib-x32-qemu/tmp/work/x86_64-x32-poky-linux-gnux32/lttng-ust-0.15-r2/ust-0.15/tests/libustctl_function_tests&apos;
| make[3]: Nothing to be done for `install-exec-am&apos;.
| make[3]: Nothing to be done for `install-data-am&apos;.
| make[3]: Leaving directory `/disk0/pokybuild/build-multilib-x32-qemu/tmp/work/x86_64-x32-poky-linux-gnux32/lttng-ust-0.15-r2/ust-0.15/tests/libustctl_function_tests&apos;
| make[2]: Leaving directory `/disk0/pokybuild/build-multilib-x32-qemu/tmp/work/x86_64-x32-poky-linux-gnux32/lttng-ust-0.15-r2/ust-0.15/tests/libustctl_function_tests&apos;
| Making install in exit-fast
| make[2]: Entering directory `/disk0/pokybuild/build-multilib-x32-qemu/tmp/work/x86_64-x32-poky-linux-gnux32/lttng-ust-0.15-r2/ust-0.15/tests/exit-fast&apos;
| make[3]: Entering directory `/disk0/pokybuild/build-multilib-x32-qemu/tmp/work/x86_64-x32-poky-linux-gnux32/lttng-ust-0.15-r2/ust-0.15/tests/exit-fast&apos;
| make[3]: Nothing to be done for `install-exec-am&apos;.
| make[3]: Nothing to be done for `install-data-am&apos;.
| make[3]: Leaving directory `/disk0/pokybuild/build-multilib-x32-qemu/tmp/work/x86_64-x32-poky-linux-gnux32/lttng-ust-0.15-r2/ust-0.15/tests/exit-fast&apos;
| make[2]: Leaving directory `/disk0/pokybuild/build-multilib-x32-qemu/tmp/work/x86_64-x32-poky-linux-gnux32/lttng-ust-0.15-r2/ust-0.15/tests/exit-fast&apos;
| make[1]: Leaving directory `/disk0/pokybuild/build-multilib-x32-qemu/tmp/work/x86_64-x32-poky-linux-gnux32/lttng-ust-0.15-r2/ust-0.15/tests&apos;
| Making install in libustinstr-malloc
| make[1]: Entering directory `/disk0/pokybuild/build-multilib-x32-qemu/tmp/work/x86_64-x32-poky-linux-gnux32/lttng-ust-0.15-r2/ust-0.15/libustinstr-malloc&apos;
| make[2]: Entering directory `/disk0/pokybuild/build-multilib-x32-qemu/tmp/work/x86_64-x32-poky-linux-gnux32/lttng-ust-0.15-r2/ust-0.15/libustinstr-malloc&apos;
| test -z &quot;/usr/lib&quot; || /bin/mkdir -p &quot;/disk0/pokybuild/build-multilib-x32-qemu/tmp/work/x86_64-x32-poky-linux-gnux32/lttng-ust-0.15-r2/image/usr/lib&quot;
|  /bin/sh ../x86_64-poky-linux-gnux32-libtool   --mode=install /usr/bin/install -c   libustinstr-malloc.la &apos;/disk0/pokybuild/build-multilib-x32-qemu/tmp/work/x86_64-x32-poky-linux-gnux32/lttng-ust-0.15-r2/image/usr/lib&apos;
| x86_64-poky-linux-gnux32-libtool: install: /usr/bin/install -c .libs/libustinstr-malloc.so.0.0.0 /disk0/pokybuild/build-multilib-x32-qemu/tmp/work/x86_64-x32-poky-linux-gnux32/lttng-ust-0.15-r2/image/usr/lib/libustinstr-malloc.so.0.0.0
| x86_64-poky-linux-gnux32-libtool: install: (cd /disk0/pokybuild/build-multilib-x32-qemu/tmp/work/x86_64-x32-poky-linux-gnux32/lttng-ust-0.15-r2/image/usr/lib &amp;&amp; { ln -s -f libustinstr-malloc.so.0.0.0 libustinstr-malloc.so.0 || { rm -f libustinstr-malloc.so.0 &amp;&amp; ln -s libustinstr-malloc.so.0.0.0 libustinstr-malloc.so.0; }; })
| x86_64-poky-linux-gnux32-libtool: install: (cd /disk0/pokybuild/build-multilib-x32-qemu/tmp/work/x86_64-x32-poky-linux-gnux32/lttng-ust-0.15-r2/image/usr/lib &amp;&amp; { ln -s -f libustinstr-malloc.so.0.0.0 libustinstr-malloc.so || { rm -f libustinstr-malloc.so &amp;&amp; ln -s libustinstr-malloc.so.0.0.0 libustinstr-malloc.so; }; })
| x86_64-poky-linux-gnux32-libtool: install: /usr/bin/install -c .libs/libustinstr-malloc.lai /disk0/pokybuild/build-multilib-x32-qemu/tmp/work/x86_64-x32-poky-linux-gnux32/lttng-ust-0.15-r2/image/usr/lib/libustinstr-malloc.la
| x86_64-poky-linux-gnux32-libtool: install: /usr/bin/install -c .libs/libustinstr-malloc.a /disk0/pokybuild/build-multilib-x32-qemu/tmp/work/x86_64-x32-poky-linux-gnux32/lttng-ust-0.15-r2/image/usr/lib/libustinstr-malloc.a
| x86_64-poky-linux-gnux32-libtool: install: chmod 644 /disk0/pokybuild/build-multilib-x32-qemu/tmp/work/x86_64-x32-poky-linux-gnux32/lttng-ust-0.15-r2/image/usr/lib/libustinstr-malloc.a
| x86_64-poky-linux-gnux32-libtool: install: x86_64-poky-linux-gnux32-ranlib /disk0/pokybuild/build-multilib-x32-qemu/tmp/work/x86_64-x32-poky-linux-gnux32/lttng-ust-0.15-r2/image/usr/lib/libustinstr-malloc.a
| x86_64-poky-linux-gnux32-libtool: install: warning: remember to run `x86_64-poky-linux-gnux32-libtool --finish /usr/lib&apos;
| make[2]: Nothing to be done for `install-data-am&apos;.
| make[2]: Leaving directory `/disk0/pokybuild/build-multilib-x32-qemu/tmp/work/x86_64-x32-poky-linux-gnux32/lttng-ust-0.15-r2/ust-0.15/libustinstr-malloc&apos;
| make[1]: Leaving directory `/disk0/pokybuild/build-multilib-x32-qemu/tmp/work/x86_64-x32-poky-linux-gnux32/lttng-ust-0.15-r2/ust-0.15/libustinstr-malloc&apos;
| Making install in libustconsumer
| make[1]: Entering directory `/disk0/pokybuild/build-multilib-x32-qemu/tmp/work/x86_64-x32-poky-linux-gnux32/lttng-ust-0.15-r2/ust-0.15/libustconsumer&apos;
| make[2]: Entering directory `/disk0/pokybuild/build-multilib-x32-qemu/tmp/work/x86_64-x32-poky-linux-gnux32/lttng-ust-0.15-r2/ust-0.15/libustconsumer&apos;
| test -z &quot;/usr/lib&quot; || /bin/mkdir -p &quot;/disk0/pokybuild/build-multilib-x32-qemu/tmp/work/x86_64-x32-poky-linux-gnux32/lttng-ust-0.15-r2/image/usr/lib&quot;
|  /bin/sh ../x86_64-poky-linux-gnux32-libtool   --mode=install /usr/bin/install -c   libustconsumer.la &apos;/disk0/pokybuild/build-multilib-x32-qemu/tmp/work/x86_64-x32-poky-linux-gnux32/lttng-ust-0.15-r2/image/usr/lib&apos;
| x86_64-poky-linux-gnux32-libtool: install: /usr/bin/install -c .libs/libustconsumer.so.0.0.0 /disk0/pokybuild/build-multilib-x32-qemu/tmp/work/x86_64-x32-poky-linux-gnux32/lttng-ust-0.15-r2/image/usr/lib/libustconsumer.so.0.0.0
| x86_64-poky-linux-gnux32-libtool: install: (cd /disk0/pokybuild/build-multilib-x32-qemu/tmp/work/x86_64-x32-poky-linux-gnux32/lttng-ust-0.15-r2/image/usr/lib &amp;&amp; { ln -s -f libustconsumer.so.0.0.0 libustconsumer.so.0 || { rm -f libustconsumer.so.0 &amp;&amp; ln -s libustconsumer.so.0.0.0 libustconsumer.so.0; }; })
| x86_64-poky-linux-gnux32-libtool: install: (cd /disk0/pokybuild/build-multilib-x32-qemu/tmp/work/x86_64-x32-poky-linux-gnux32/lttng-ust-0.15-r2/image/usr/lib &amp;&amp; { ln -s -f libustconsumer.so.0.0.0 libustconsumer.so || { rm -f libustconsumer.so &amp;&amp; ln -s libustconsumer.so.0.0.0 libustconsumer.so; }; })
| x86_64-poky-linux-gnux32-libtool: install: /usr/bin/install -c .libs/libustconsumer.lai /disk0/pokybuild/build-multilib-x32-qemu/tmp/work/x86_64-x32-poky-linux-gnux32/lttng-ust-0.15-r2/image/usr/lib/libustconsumer.la
| x86_64-poky-linux-gnux32-libtool: install: /usr/bin/install -c .libs/libustconsumer.a /disk0/pokybuild/build-multilib-x32-qemu/tmp/work/x86_64-x32-poky-linux-gnux32/lttng-ust-0.15-r2/image/usr/lib/libustconsumer.a
| x86_64-poky-linux-gnux32-libtool: install: chmod 644 /disk0/pokybuild/build-multilib-x32-qemu/tmp/work/x86_64-x32-poky-linux-gnux32/lttng-ust-0.15-r2/image/usr/lib/libustconsumer.a
| x86_64-poky-linux-gnux32-libtool: install: x86_64-poky-linux-gnux32-ranlib /disk0/pokybuild/build-multilib-x32-qemu/tmp/work/x86_64-x32-poky-linux-gnux32/lttng-ust-0.15-r2/image/usr/lib/libustconsumer.a
| x86_64-poky-linux-gnux32-libtool: install: warning: remember to run `x86_64-poky-linux-gnux32-libtool --finish /usr/lib&apos;
| make[2]: Nothing to be done for `install-data-am&apos;.
| make[2]: Leaving directory `/disk0/pokybuild/build-multilib-x32-qemu/tmp/work/x86_64-x32-poky-linux-gnux32/lttng-ust-0.15-r2/ust-0.15/libustconsumer&apos;
| make[1]: Leaving directory `/disk0/pokybuild/build-multilib-x32-qemu/tmp/work/x86_64-x32-poky-linux-gnux32/lttng-ust-0.15-r2/ust-0.15/libustconsumer&apos;
| Making install in ust-consumerd
| make[1]: Entering directory `/disk0/pokybuild/build-multilib-x32-qemu/tmp/work/x86_64-x32-poky-linux-gnux32/lttng-ust-0.15-r2/ust-0.15/ust-consumerd&apos;
| make[2]: Entering directory `/disk0/pokybuild/build-multilib-x32-qemu/tmp/work/x86_64-x32-poky-linux-gnux32/lttng-ust-0.15-r2/ust-0.15/ust-consumerd&apos;
| test -z &quot;/usr/bin&quot; || /bin/mkdir -p &quot;/disk0/pokybuild/build-multilib-x32-qemu/tmp/work/x86_64-x32-poky-linux-gnux32/lttng-ust-0.15-r2/image/usr/bin&quot;
|   /bin/sh ../x86_64-poky-linux-gnux32-libtool   --mode=install /usr/bin/install -c ust-consumerd &apos;/disk0/pokybuild/build-multilib-x32-qemu/tmp/work/x86_64-x32-poky-linux-gnux32/lttng-ust-0.15-r2/image/usr/bin&apos;
| x86_64-poky-linux-gnux32-libtool: install: warning: `../libustconsumer/libustconsumer.la&apos; has not been installed in `/usr/lib&apos;
| x86_64-poky-linux-gnux32-libtool: install: /usr/bin/install -c .libs/ust-consumerd /disk0/pokybuild/build-multilib-x32-qemu/tmp/work/x86_64-x32-poky-linux-gnux32/lttng-ust-0.15-r2/image/usr/bin/ust-consumerd
| make[2]: Nothing to be done for `install-data-am&apos;.
| make[2]: Leaving directory `/disk0/pokybuild/build-multilib-x32-qemu/tmp/work/x86_64-x32-poky-linux-gnux32/lttng-ust-0.15-r2/ust-0.15/ust-consumerd&apos;
| make[1]: Leaving directory `/disk0/pokybuild/build-multilib-x32-qemu/tmp/work/x86_64-x32-poky-linux-gnux32/lttng-ust-0.15-r2/ust-0.15/ust-consumerd&apos;
| Making install in ustctl
| make[1]: Entering directory `/disk0/pokybuild/build-multilib-x32-qemu/tmp/work/x86_64-x32-poky-linux-gnux32/lttng-ust-0.15-r2/ust-0.15/ustctl&apos;
| make[2]: Entering directory `/disk0/pokybuild/build-multilib-x32-qemu/tmp/work/x86_64-x32-poky-linux-gnux32/lttng-ust-0.15-r2/ust-0.15/ustctl&apos;
| test -z &quot;/usr/bin&quot; || /bin/mkdir -p &quot;/disk0/pokybuild/build-multilib-x32-qemu/tmp/work/x86_64-x32-poky-linux-gnux32/lttng-ust-0.15-r2/image/usr/bin&quot;
|   /bin/sh ../x86_64-poky-linux-gnux32-libtool   --mode=install /usr/bin/install -c ustctl &apos;/disk0/pokybuild/build-multilib-x32-qemu/tmp/work/x86_64-x32-poky-linux-gnux32/lttng-ust-0.15-r2/image/usr/bin&apos;
| x86_64-poky-linux-gnux32-libtool: install: warning: `../libustctl/libustctl.la&apos; has not been installed in `/usr/lib&apos;
| x86_64-poky-linux-gnux32-libtool: install: /usr/bin/install -c .libs/ustctl /disk0/pokybuild/build-multilib-x32-qemu/tmp/work/x86_64-x32-poky-linux-gnux32/lttng-ust-0.15-r2/image/usr/bin/ustctl
| make[2]: Nothing to be done for `install-data-am&apos;.
| make[2]: Leaving directory `/disk0/pokybuild/build-multilib-x32-qemu/tmp/work/x86_64-x32-poky-linux-gnux32/lttng-ust-0.15-r2/ust-0.15/ustctl&apos;
| make[1]: Leaving directory `/disk0/pokybuild/build-multilib-x32-qemu/tmp/work/x86_64-x32-poky-linux-gnux32/lttng-ust-0.15-r2/ust-0.15/ustctl&apos;
| Making install in libustfork
| make[1]: Entering directory `/disk0/pokybuild/build-multilib-x32-qemu/tmp/work/x86_64-x32-poky-linux-gnux32/lttng-ust-0.15-r2/ust-0.15/libustfork&apos;
| make[2]: Entering directory `/disk0/pokybuild/build-multilib-x32-qemu/tmp/work/x86_64-x32-poky-linux-gnux32/lttng-ust-0.15-r2/ust-0.15/libustfork&apos;
| test -z &quot;/usr/lib&quot; || /bin/mkdir -p &quot;/disk0/pokybuild/build-multilib-x32-qemu/tmp/work/x86_64-x32-poky-linux-gnux32/lttng-ust-0.15-r2/image/usr/lib&quot;
|  /bin/sh ../x86_64-poky-linux-gnux32-libtool   --mode=install /usr/bin/install -c   libustfork.la &apos;/disk0/pokybuild/build-multilib-x32-qemu/tmp/work/x86_64-x32-poky-linux-gnux32/lttng-ust-0.15-r2/image/usr/lib&apos;
| x86_64-poky-linux-gnux32-libtool: install: warning: relinking `libustfork.la&apos;
| x86_64-poky-linux-gnux32-libtool: install: (cd /disk0/pokybuild/build-multilib-x32-qemu/tmp/work/x86_64-x32-poky-linux-gnux32/lttng-ust-0.15-r2/ust-0.15/libustfork; /bin/sh /disk0/pokybuild/build-multilib-x32-qemu/tmp/work/x86_64-x32-poky-linux-gnux32/lttng-ust-0.15-r2/ust-0.15/x86_64-poky-linux-gnux32-libtool  --tag CC --mode=relink ccache x86_64-poky-linux-gnux32-gcc -mx32 --sysroot=/disk0/pokybuild/build-multilib-x32-qemu/tmp/sysroots/qemux86-64 -fno-strict-aliasing -Wall -O2 -pipe -g -feliminate-unused-debug-types -Wl,-O1 -Wl,--hash-style=gnu -Wl,--as-needed -o libustfork.la -rpath /usr/lib ustfork.lo -ldl ../libust/libust.la -lurcu-bp -lurcu-bp -inst-prefix-dir /disk0/pokybuild/build-multilib-x32-qemu/tmp/work/x86_64-x32-poky-linux-gnux32/lttng-ust-0.15-r2/image)
| x86_64-poky-linux-gnux32-libtool: relink: warning: `/disk0/pokybuild/build-multilib-x32-qemu/tmp/sysroots/qemux86-64/usr/lib/liburcu-bp.la&apos; seems to be moved
| x86_64-poky-linux-gnux32-libtool: relink: warning: `/disk0/pokybuild/build-multilib-x32-qemu/tmp/sysroots/qemux86-64/usr/lib/liburcu-cds.la&apos; seems to be moved
| x86_64-poky-linux-gnux32-libtool: relink: warning: `/disk0/pokybuild/build-multilib-x32-qemu/tmp/sysroots/qemux86-64/usr/lib/liburcu-cds.la&apos; seems to be moved
| x86_64-poky-linux-gnux32-libtool: relink: warning: `/disk0/pokybuild/build-multilib-x32-qemu/tmp/sysroots/qemux86-64/usr/lib/liburcu-cds.la&apos; seems to be moved
| x86_64-poky-linux-gnux32-libtool: relink: ccache x86_64-poky-linux-gnux32-gcc   -mx32  --sysroot=/disk0/pokybuild/build-multilib-x32-qemu/tmp/sysroots/qemux86-64 -shared  -fPIC -DPIC  .libs/ustfork.o   -ldl -L/disk0/pokybuild/build-multilib-x32-qemu/tmp/work/x86_64-x32-poky-linux-gnux32/lttng-ust-0.15-r2/image/usr/lib -L/disk0/pokybuild/build-multilib-x32-qemu/tmp/sysroots/qemux86-64/usr/lib -lust -lrt -lurcu-bp -lurcu-cds -lpthread  -mx32 --sysroot=/disk0/pokybuild/build-multilib-x32-qemu/tmp/sysroots/qemux86-64 -O2 -Wl,-O1 -Wl,--hash-style=gnu -Wl,--as-needed   -Wl,-soname -Wl,libustfork.so.0 -o .libs/libustfork.so.0.0.0
| /disk0/pokybuild/build-multilib-x32-qemu/tmp/sysroots/x86_64-linux/usr/libexec/x86_64-x32-poky-linux-gnux32/gcc/x86_64-poky-linux-gnux32/4.7.0/ld: skipping incompatible /disk0/pokybuild/build-multilib-x32-qemu/tmp/work/x86_64-x32-poky-linux-gnux32/lttng-ust-0.15-r2/image/usr/lib/libust.so when searching for -lust
| /disk0/pokybuild/build-multilib-x32-qemu/tmp/sysroots/x86_64-linux/usr/libexec/x86_64-x32-poky-linux-gnux32/gcc/x86_64-poky-linux-gnux32/4.7.0/ld: /disk0/pokybuild/build-multilib-x32-qemu/tmp/work/x86_64-x32-poky-linux-gnux32/lttng-ust-0.15-r2/image/usr/lib/libust.a(libust_la-tracectl.o): relocation R_X86_64_32S against `.rodata&apos; can not be used when making a shared object; recompile with -fPIC
| /disk0/pokybuild/build-multilib-x32-qemu/tmp/work/x86_64-x32-poky-linux-gnux32/lttng-ust-0.15-r2/image/usr/lib/libust.a: could not read symbols: Bad value
| collect2: error: ld returned 1 exit status
| x86_64-poky-linux-gnux32-libtool: install: error: relink `libustfork.la&apos; with the above command before installing it
| make[2]: *** [install-libLTLIBRARIES] Error 1
| make[2]: Leaving directory `/disk0/pokybuild/build-multilib-x32-qemu/tmp/work/x86_64-x32-poky-linux-gnux32/lttng-ust-0.15-r2/ust-0.15/libustfork&apos;
| make[1]: *** [install-am] Error 2
| make[1]: Leaving directory `/disk0/pokybuild/build-multilib-x32-qemu/tmp/work/x86_64-x32-poky-linux-gnux32/lttng-ust-0.15-r2/ust-0.15/libustfork&apos;
| make: *** [install-recursive] Error 1
| ERROR: oe_runmake failed
| ERROR: Function &apos;do_install&apos; failed (see /disk0/pokybuild/build-multilib-x32-qemu/tmp/work/x86_64-x32-poky-linux-gnux32/lttng-ust-0.15-r2/temp/log.do_install.7456 for further information)
NOTE: package lttng-ust-0.15-r2: task do_install: Failed</thetext>
  </long_desc><long_desc isprivate="0" >
    <commentid>17457</commentid>
    <comment_count>1</comment_count>
    <who name="Nitin Kamble">nitin.a.kamble</who>
    <bug_when>2011-12-01 14:35:12 +0000</bug_when>
    <thetext>This issue does not exist with the latest meta-x32 layer.
Nitin</thetext>
  </long_desc>
      
      

    </bug>

</bugzilla>