<?xml version="1.0" encoding="UTF-8" standalone="yes" ?>
<!DOCTYPE bugzilla SYSTEM "https://bugzilla.yoctoproject.org/page.cgi?id=bugzilla.dtd">

<bugzilla version="5.0.6"
          urlbase="https://bugzilla.yoctoproject.org/"
          
          maintainer="it-coreprojects-helpdesk@linuxfoundation.org"
>

    <bug>
          <bug_id>14097</bug_id>
          
          <creation_ts>2020-10-19 06:06:07 +0000</creation_ts>
          <short_desc>selftest test_testimage_virgl_gtk_sdl failed on ubuntu1804-ty-3</short_desc>
          <delta_ts>2020-10-22 07:48:25 +0000</delta_ts>
          <reporter_accessible>1</reporter_accessible>
          <cclist_accessible>1</cclist_accessible>
          <classification_id>7</classification_id>
          <classification>Build System, Metadata &amp; Runtime</classification>
          <product>OE-Core</product>
          <component>core</component>
          <version>3.2</version>
          <rep_platform>x86</rep_platform>
          <op_sys>Multiple</op_sys>
          <bug_status>RESOLVED</bug_status>
          <resolution>FIXED</resolution>
          
          
          <bug_file_loc></bug_file_loc>
          <status_whiteboard>AB-INT</status_whiteboard>
          <keywords></keywords>
          <priority>Undecided</priority>
          <bug_severity>normal</bug_severity>
          <target_milestone>---</target_milestone>
          
          
          <everconfirmed>1</everconfirmed>
          <reporter name="Richard Purdie">richard.purdie</reporter>
          <assigned_to name="Unassigned">unassigned</assigned_to>
          <cc>alex.kanavin</cc>
    
    <cc>meta.mr.watcher</cc>
    
    <cc>meta.watcher</cc>
    
    <cc>randy.macleod</cc>
          
          
          <cf_os>---</cf_os>
          <cf_regression_type>---</cf_regression_type>
          
          <cf_docchange>No (bug/feature does not impact docs)</cf_docchange>

      

      

      

          <comment_sort_order>oldest_to_newest</comment_sort_order>  
          <long_desc isprivate="0" >
    <commentid>88419</commentid>
    <comment_count>0</comment_count>
    <who name="Richard Purdie">richard.purdie</who>
    <bug_when>2020-10-19 06:06:07 +0000</bug_when>
    <thetext>https://autobuilder.yoctoproject.org/typhoon/#/builders/87/builds/1475/steps/8/logs/step2d

I&apos;m wondering if this timeout (in a build which was clearly on a high load system given the spectrum of other failures) means we need to increase the timeout slightly?

2020-10-17 15:34:48,167 - oe-selftest - INFO - runtime_test.TestImage.test_testimage_virgl_gtk_sdl (subunit.RemotedTestCase)
2020-10-17 15:34:48,167 - oe-selftest - INFO -  ... FAIL
2020-10-17 15:34:48,167 - oe-selftest - INFO - 6: 11/12 296/416 (236.73s) (runtime_test.TestImage.test_testimage_virgl_gtk_sdl)
2020-10-17 15:34:48,168 - oe-selftest - INFO - testtools.testresult.real._StringException: Traceback (most recent call last):
  File &quot;/home/pokybuild/yocto-worker/oe-selftest-ubuntu/build/meta/lib/oeqa/selftest/cases/runtime_test.py&quot;, line 206, in test_testimage_virgl_gtk_sdl
    bitbake(&apos;-c testimage core-image-minimal&apos;)
  File &quot;/home/pokybuild/yocto-worker/oe-selftest-ubuntu/build/meta/lib/oeqa/utils/commands.py&quot;, line 223, in bitbake
    return runCmd(cmd, ignore_status, timeout, output_log=output_log, **options)
  File &quot;/home/pokybuild/yocto-worker/oe-selftest-ubuntu/build/meta/lib/oeqa/utils/commands.py&quot;, line 201, in runCmd
    raise AssertionError(&quot;Command &apos;%s&apos; returned non-zero exit status %d:\n%s&quot; % (command, result.status, exc_output))
AssertionError: Command &apos;bitbake  -c testimage core-image-minimal&apos; returned non-zero exit status 1:
Loading cache...done.
Loaded 1399 entries from dependency cache.
NOTE: Resolving any missing task queue dependencies
Build Configuration:
BB_VERSION           = &quot;1.47.0&quot;
BUILD_SYS            = &quot;x86_64-linux&quot;
NATIVELSBSTRING      = &quot;universal&quot;
TARGET_SYS           = &quot;x86_64-poky-linux&quot;
MACHINE              = &quot;qemux86-64&quot;
DISTRO               = &quot;poky&quot;
DISTRO_VERSION       = &quot;3.1+snapshot-20201017&quot;
TUNE_FEATURES        = &quot;m64 core2&quot;
TARGET_FPU           = &quot;&quot;
meta                 
meta-poky            
meta-yocto-bsp       = &quot;master-next:5625b298dc98ee43239288bf2e29ff48aa909fbc&quot;
meta-selftest        = &quot;master:06be573a36e82e4088ed59d01f1638b3fb09f19b&quot;
Initialising tasks...done.
Sstate summary: Wanted 0 Found 0 Missed 0 Current 250 (0% match, 100% complete)
NOTE: Executing Tasks
NOTE: Setscene tasks completed
NOTE: Running task 1154 of 1154 (/home/pokybuild/yocto-worker/oe-selftest-ubuntu/build/meta/recipes-core/images/core-image-minimal.bb:do_testimage)
NOTE: recipe core-image-minimal-1.0-r0: task do_testimage: Started
Traceback (most recent call last):
  File &quot;/home/pokybuild/yocto-worker/oe-selftest-ubuntu/build/meta/lib/oeqa/core/decorator/__init__.py&quot;, line 36, in wrapped_f
    return func(*args, **kwargs)
  File &quot;/home/pokybuild/yocto-worker/oe-selftest-ubuntu/build/build-st-42739/meta-selftest/lib/oeqa/runtime/cases/virgl.py&quot;, line 18, in test_kmscube
    self.assertIn(&apos;renderer: &quot;virgl&quot;&apos;, output, &quot;kmscube does not seem to use virgl:\n%s&quot; %(output))
AssertionError: &apos;renderer: &quot;virgl&quot;&apos; not found in &apos;\nProcess killed - no output for 30 seconds. Total running time: 35 seconds.&apos; : kmscube does not seem to use virgl:
Process killed - no output for 30 seconds. Total running time: 35 seconds.
RESULTS:
RESULTS - ping.PingTest.test_ping: PASSED (0.04s)
RESULTS - ssh.SSHTest.test_ssh: PASSED (0.54s)
RESULTS - virgl.VirglTest.test_kernel_driver: PASSED (0.03s)
RESULTS - virgl.VirglTest.test_kmscube: FAILED (35.15s)
SUMMARY:
core-image-minimal () - Ran 4 tests in 35.765s
core-image-minimal - FAIL - Required tests failed (successes=3, skipped=0, failures=1, errors=0)
ERROR: core-image-minimal-1.0-r0 do_testimage: core-image-minimal - FAILED - check the task log and the ssh log
ERROR: Logfile of failure stored in: /home/pokybuild/yocto-worker/oe-selftest-ubuntu/build/build-st-42739/tmp/work/qemux86_64-poky-linux/core-image-minimal/1.0-r0/temp/log.do_testimage.6514
NOTE: recipe core-image-minimal-1.0-r0: task do_testimage: Failed
ERROR: Task (/home/pokybuild/yocto-worker/oe-selftest-ubuntu/build/meta/recipes-core/images/core-image-minimal.bb:do_testimage) failed with exit code &apos;1&apos;
NOTE: Tasks Summary: Attempted 1154 tasks of which 1153 didn&apos;t need to be rerun and 1 failed.
NOTE: The errors for this build are stored in /home/pokybuild/yocto-worker/oe-selftest-ubuntu/build/build-st-42739/tmp/log/error-report/error_report_20201017153318.txt
You can send the errors to a reports server by running:
  send-error-report /home/pokybuild/yocto-worker/oe-selftest-ubuntu/build/build-st-42739/tmp/log/error-report/error_report_20201017153318.txt [-s server]
NOTE: The contents of these logs will be posted in public if you use the above command with the default server. Please ensure you remove any identifying or proprietary information when prompted before sending.
Summary: 1 task failed:
  /home/pokybuild/yocto-worker/oe-selftest-ubuntu/build/meta/recipes-core/images/core-image-minimal.bb:do_testimage
Summary: There was 1 ERROR message shown, returning a non-zero exit code.</thetext>
  </long_desc><long_desc isprivate="0" >
    <commentid>88425</commentid>
    <comment_count>1</comment_count>
    <who name="Alexander Kanavin">alex.kanavin</who>
    <bug_when>2020-10-19 08:43:57 +0000</bug_when>
    <thetext>Patch to increase the timeout:
https://lists.openembedded.org/g/openembedded-core/message/143598</thetext>
  </long_desc><long_desc isprivate="0" >
    <commentid>88457</commentid>
    <comment_count>2</comment_count>
    <who name="Randy MacLeod">randy.macleod</who>
    <bug_when>2020-10-22 07:48:25 +0000</bug_when>
    <thetext>Likely a very rare failure that happened with 14095, 14095.

Likely resolved by:
https://lists.openembedded.org/g/openembedded-core/message/143598</thetext>
  </long_desc>
      
      

    </bug>

</bugzilla>