<?xml version="1.0" encoding="UTF-8" standalone="yes" ?>
<!DOCTYPE bugzilla SYSTEM "https://bugzilla.yoctoproject.org/page.cgi?id=bugzilla.dtd">

<bugzilla version="5.0.6"
          urlbase="https://bugzilla.yoctoproject.org/"
          
          maintainer="it-coreprojects-helpdesk@linuxfoundation.org"
>

    <bug>
          <bug_id>1411</bug_id>
          
          <creation_ts>2011-08-25 14:35:42 +0000</creation_ts>
          <short_desc>x32: strace build fails</short_desc>
          <delta_ts>2021-08-17 10:54:38 +0000</delta_ts>
          <reporter_accessible>1</reporter_accessible>
          <cclist_accessible>1</cclist_accessible>
          <classification_id>7</classification_id>
          <classification>Build System, Metadata &amp; Runtime</classification>
          <product>OE-Core</product>
          <component>core</component>
          <version>unspecified</version>
          <rep_platform>x86</rep_platform>
          <op_sys>x86_64</op_sys>
          <bug_status>RESOLVED</bug_status>
          <resolution>WORKSFORME</resolution>
          
          
          <bug_file_loc></bug_file_loc>
          <status_whiteboard></status_whiteboard>
          <keywords></keywords>
          <priority>Medium</priority>
          <bug_severity>normal</bug_severity>
          <target_milestone>1.2</target_milestone>
          
          <blocked>1579</blocked>
          <everconfirmed>1</everconfirmed>
          <reporter name="Nitin Kamble">nitin.a.kamble</reporter>
          <assigned_to name="Nitin Kamble">nitin.a.kamble</assigned_to>
          <cc>fransmeulenbroeks</cc>
    
    <cc>hjl.tools</cc>
    
    <cc>meta.mr.watcher</cc>
    
    <cc>meta.watcher</cc>
          
          
          <cf_os>---</cf_os>
          <cf_regression_type>---</cf_regression_type>
          
          <cf_docchange>---</cf_docchange>

      

      

      

          <comment_sort_order>oldest_to_newest</comment_sort_order>  
          <long_desc isprivate="0" >
    <commentid>15776</commentid>
    <comment_count>0</comment_count>
    <who name="Nitin Kamble">nitin.a.kamble</who>
    <bug_when>2011-08-25 14:35:42 +0000</bug_when>
    <thetext>ERROR: Logfile of failure stored in: /disk0/pokybuild/build-multilib-x32-qemu/tmp/work/x86_64-x32-poky-linux-gnux32/strace-4.5.20-r2/temp/log.do_compile.7466
Log data follows:
| DEBUG: SITE files [&apos;endian-little&apos;, &apos;common-linux&apos;, &apos;common-glibc&apos;, &apos;bit-32&apos;, &apos;ix86-common&apos;, &apos;x86_64-linux-gnux32&apos;, &apos;common&apos;]
| NOTE: make -j 16
| make  all-am
| make[1]: Entering directory `/disk0/pokybuild/build-multilib-x32-qemu/tmp/work/x86_64-x32-poky-linux-gnux32/strace-4.5.20-r2/strace-4.5.20&apos;
| ccache x86_64-poky-linux-gnux32-gcc   -mx32  --sysroot=/disk0/pokybuild/build-multilib-x32-qemu/tmp/sysroots/qemux86-64 -DHAVE_CONFIG_H -I. -I./linux/x86_64 -I./linux   -Wall -O2 -pipe -g -feliminate-unused-debug-types -MT syscall.o -MD -MP -MF .deps/syscall.Tpo -c -o syscall.o syscall.c
| In file included from ./linux/x86_64/syscallent1.h:7:0,
|                  from syscall.c:121:
| ./linux/i386/syscallent.h:133:37: error: &apos;__NR_socketcall&apos; undeclared here (not in a function)
| ./linux/i386/syscallent.h:148:28: error: &apos;__NR_ipc&apos; undeclared here (not in a function)
| make[1]: *** [syscall.o] Error 1
| make[1]: Leaving directory `/disk0/pokybuild/build-multilib-x32-qemu/tmp/work/x86_64-x32-poky-linux-gnux32/strace-4.5.20-r2/strace-4.5.20&apos;
| make: *** [all] Error 2
| ERROR: oe_runmake failed
| ERROR: Function &apos;do_compile&apos; failed (see /disk0/pokybuild/build-multilib-x32-qemu/tmp/work/x86_64-x32-poky-linux-gnux32/strace-4.5.20-r2/temp/log.do_compile.7466 for further information)</thetext>
  </long_desc><long_desc isprivate="0" >
    <commentid>17458</commentid>
    <comment_count>1</comment_count>
    <who name="Nitin Kamble">nitin.a.kamble</who>
    <bug_when>2011-12-01 14:36:28 +0000</bug_when>
    <thetext>This issue is not present with the latest meta-x32 layer.
nitin</thetext>
  </long_desc><long_desc isprivate="0" >
    <commentid>91197</commentid>
    <comment_count>2</comment_count>
    <who name="Frans Meulenbroeks">fransmeulenbroeks</who>
    <bug_when>2021-08-17 10:54:38 +0000</bug_when>
    <thetext>*** Bug 14514 has been marked as a duplicate of this bug. ***</thetext>
  </long_desc>
      
      

    </bug>

</bugzilla>