<?xml version="1.0" encoding="UTF-8" standalone="yes" ?>
<!DOCTYPE bugzilla SYSTEM "https://bugzilla.yoctoproject.org/page.cgi?id=bugzilla.dtd">

<bugzilla version="5.0.6"
          urlbase="https://bugzilla.yoctoproject.org/"
          
          maintainer="it-coreprojects-helpdesk@linuxfoundation.org"
>

    <bug>
          <bug_id>1413</bug_id>
          
          <creation_ts>2011-08-25 14:38:29 +0000</creation_ts>
          <short_desc>x32: libxmu building fails</short_desc>
          <delta_ts>2011-12-01 14:41:38 +0000</delta_ts>
          <reporter_accessible>1</reporter_accessible>
          <cclist_accessible>1</cclist_accessible>
          <classification_id>7</classification_id>
          <classification>Build System, Metadata &amp; Runtime</classification>
          <product>OE-Core</product>
          <component>core</component>
          <version>unspecified</version>
          <rep_platform>x86</rep_platform>
          <op_sys>x86_64</op_sys>
          <bug_status>RESOLVED</bug_status>
          <resolution>WORKSFORME</resolution>
          
          
          <bug_file_loc></bug_file_loc>
          <status_whiteboard></status_whiteboard>
          <keywords></keywords>
          <priority>Medium</priority>
          <bug_severity>normal</bug_severity>
          <target_milestone>1.2</target_milestone>
          
          <blocked>1579</blocked>
          <everconfirmed>1</everconfirmed>
          <reporter name="Nitin Kamble">nitin.a.kamble</reporter>
          <assigned_to name="Nitin Kamble">nitin.a.kamble</assigned_to>
          <cc>hjl.tools</cc>
    
    <cc>meta.mr.watcher</cc>
    
    <cc>meta.watcher</cc>
    
    <cc>sgw</cc>
          
          
          <cf_os>---</cf_os>
          <cf_regression_type>---</cf_regression_type>
          
          <cf_docchange>---</cf_docchange>

      

      

      

          <comment_sort_order>oldest_to_newest</comment_sort_order>  
          <long_desc isprivate="0" >
    <commentid>15778</commentid>
    <comment_count>0</comment_count>
    <who name="Nitin Kamble">nitin.a.kamble</who>
    <bug_when>2011-08-25 14:38:29 +0000</bug_when>
    <thetext>ERROR: Function &apos;do_compile&apos; failed (see /disk0/pokybuild/build-multilib-x32-qemu/tmp/work/x86_64-x32-poky-linux-gnux32/libxmu-1_1.1.0-r0/temp/log.do_compile.6714 for further information)
ERROR: Logfile of failure stored in: /disk0/pokybuild/build-multilib-x32-qemu/tmp/work/x86_64-x32-poky-linux-gnux32/libxmu-1_1.1.0-r0/temp/log.do_compile.6714
Log data follows:
| DEBUG: SITE files [&apos;endian-little&apos;, &apos;common-linux&apos;, &apos;common-glibc&apos;, &apos;bit-32&apos;, &apos;ix86-common&apos;, &apos;x86_64-linux-gnux32&apos;, &apos;common&apos;]
| NOTE: make -j 16
| make  all-recursive
| make[1]: Entering directory `/disk0/pokybuild/build-multilib-x32-qemu/tmp/work/x86_64-x32-poky-linux-gnux32/libxmu-1_1.1.0-r0/libXmu-1.1.0&apos;
| Making all in include
| make[2]: Entering directory `/disk0/pokybuild/build-multilib-x32-qemu/tmp/work/x86_64-x32-poky-linux-gnux32/libxmu-1_1.1.0-r0/libXmu-1.1.0/include&apos;
| make[2]: Nothing to be done for `all&apos;.
| make[2]: Leaving directory `/disk0/pokybuild/build-multilib-x32-qemu/tmp/work/x86_64-x32-poky-linux-gnux32/libxmu-1_1.1.0-r0/libXmu-1.1.0/include&apos;
| Making all in src
| make[2]: Entering directory `/disk0/pokybuild/build-multilib-x32-qemu/tmp/work/x86_64-x32-poky-linux-gnux32/libxmu-1_1.1.0-r0/libXmu-1.1.0/src&apos;
| /bin/sh ../x86_64-poky-linux-gnux32-libtool  --tag=CC   --mode=compile ccache x86_64-poky-linux-gnux32-gcc   -mx32  --sysroot=/disk0/pokybuild/build-multilib-x32-qemu/tmp/sysroots/qemux86-64 -std=gnu99 -DHAVE_CONFIG_H -I. -I..  -I../include -I../include/X11/Xmu -DBITMAPDIR=\&quot;/usr/include/X11/bitmaps\&quot; -D_BSD_SOURCE  -Wall -Wpointer-arith -Wstrict-prototypes -Wmissing-prototypes -Wmissing-declarations -Wnested-externs -fno-strict-aliasing -Wbad-function-cast -Wformat=2 -Wold-style-definition -Wdeclaration-after-statement  -O2 -pipe -g -feliminate-unused-debug-types -MT EditresCom.lo -MD -MP -MF .deps/EditresCom.Tpo -c -o EditresCom.lo EditresCom.c
| x86_64-poky-linux-gnux32-libtool: compile:  ccache x86_64-poky-linux-gnux32-gcc -mx32 --sysroot=/disk0/pokybuild/build-multilib-x32-qemu/tmp/sysroots/qemux86-64 -std=gnu99 -DHAVE_CONFIG_H -I. -I.. -I../include -I../include/X11/Xmu -DBITMAPDIR=\&quot;/usr/include/X11/bitmaps\&quot; -D_BSD_SOURCE -Wall -Wpointer-arith -Wstrict-prototypes -Wmissing-prototypes -Wmissing-declarations -Wnested-externs -fno-strict-aliasing -Wbad-function-cast -Wformat=2 -Wold-style-definition -Wdeclaration-after-statement -O2 -pipe -g -feliminate-unused-debug-types -MT EditresCom.lo -MD -MP -MF .deps/EditresCom.Tpo -c EditresCom.c  -fPIC -DPIC -o .libs/EditresCom.o
| EditresCom.c: In function &apos;HandleToolkitErrors&apos;:
| EditresCom.c:998:2: warning: format not a string literal, argument types not checked [-Wformat-nonliteral]
| EditresCom.c: In function &apos;_XEditresGetStringValues&apos;:
| EditresCom.c:2198:6: error: duplicate case value
| EditresCom.c:2194:6: error: previously used here
| make[2]: *** [EditresCom.lo] Error 1
| make[2]: Leaving directory `/disk0/pokybuild/build-multilib-x32-qemu/tmp/work/x86_64-x32-poky-linux-gnux32/libxmu-1_1.1.0-r0/libXmu-1.1.0/src&apos;
| make[1]: *** [all-recursive] Error 1
| make[1]: Leaving directory `/disk0/pokybuild/build-multilib-x32-qemu/tmp/work/x86_64-x32-poky-linux-gnux32/libxmu-1_1.1.0-r0/libXmu-1.1.0&apos;
| make: *** [all] Error 2
| ERROR: oe_runmake failed
| ERROR: Function &apos;do_compile&apos; failed (see /disk0/pokybuild/build-multilib-x32-qemu/tmp/work/x86_64-x32-poky-linux-gnux32/libxmu-1_1.1.0-r0/temp/log.do_compile.6714 for further information)</thetext>
  </long_desc><long_desc isprivate="0" >
    <commentid>17459</commentid>
    <comment_count>1</comment_count>
    <who name="Nitin Kamble">nitin.a.kamble</who>
    <bug_when>2011-12-01 14:41:38 +0000</bug_when>
    <thetext>This failure is not present with latest meta-x32 layer.
Nitin</thetext>
  </long_desc>
      
      

    </bug>

</bugzilla>