<?xml version="1.0" encoding="UTF-8" standalone="yes" ?>
<!DOCTYPE bugzilla SYSTEM "https://bugzilla.yoctoproject.org/page.cgi?id=bugzilla.dtd">

<bugzilla version="5.0.6"
          urlbase="https://bugzilla.yoctoproject.org/"
          
          maintainer="it-coreprojects-helpdesk@linuxfoundation.org"
>

    <bug>
          <bug_id>1415</bug_id>
          
          <creation_ts>2011-08-25 14:41:42 +0000</creation_ts>
          <short_desc>x32: mesa-dri building fails</short_desc>
          <delta_ts>2011-12-01 14:59:37 +0000</delta_ts>
          <reporter_accessible>1</reporter_accessible>
          <cclist_accessible>1</cclist_accessible>
          <classification_id>7</classification_id>
          <classification>Build System, Metadata &amp; Runtime</classification>
          <product>OE-Core</product>
          <component>core</component>
          <version>unspecified</version>
          <rep_platform>x86</rep_platform>
          <op_sys>x86_64</op_sys>
          <bug_status>RESOLVED</bug_status>
          <resolution>WORKSFORME</resolution>
          
          
          <bug_file_loc></bug_file_loc>
          <status_whiteboard></status_whiteboard>
          <keywords></keywords>
          <priority>Medium</priority>
          <bug_severity>normal</bug_severity>
          <target_milestone>1.2</target_milestone>
          
          <blocked>1579</blocked>
          <everconfirmed>1</everconfirmed>
          <reporter name="Nitin Kamble">nitin.a.kamble</reporter>
          <assigned_to name="Nitin Kamble">nitin.a.kamble</assigned_to>
          <cc>hjl.tools</cc>
    
    <cc>jiajun.xu</cc>
    
    <cc>meta.mr.watcher</cc>
    
    <cc>meta.watcher</cc>
    
    <cc>wenhuax.fan</cc>
          
          
          <cf_os>---</cf_os>
          <cf_regression_type>---</cf_regression_type>
          
          <cf_docchange>---</cf_docchange>

      

      

      

          <comment_sort_order>oldest_to_newest</comment_sort_order>  
          <long_desc isprivate="0" >
    <commentid>15780</commentid>
    <comment_count>0</comment_count>
    <who name="Nitin Kamble">nitin.a.kamble</who>
    <bug_when>2011-08-25 14:41:42 +0000</bug_when>
    <thetext>ERROR: Function &apos;do_compile&apos; failed (see /disk0/pokybuild/build-multilib-x32-qemu/tmp/work/x86_64-x32-poky-linux-gnux32/mesa-dri-7.10.2-r1/temp/log.do_compile.6772 for further information)
ERROR: Logfile of failure stored in: /disk0/pokybuild/build-multilib-x32-qemu/tmp/work/x86_64-x32-poky-linux-gnux32/mesa-dri-7.10.2-r1/temp/log.do_compile.6772
Log data follows:
| DEBUG: SITE files [&apos;endian-little&apos;, &apos;common-linux&apos;, &apos;common-glibc&apos;, &apos;bit-32&apos;, &apos;ix86-common&apos;, &apos;x86_64-linux-gnux32&apos;, &apos;common&apos;]
| NOTE: make -j 16
| make[1]: Entering directory `/disk0/pokybuild/build-multilib-x32-qemu/tmp/work/x86_64-x32-poky-linux-gnux32/mesa-dri-7.10.2-r1/Mesa-7.10.2/src&apos;
| Making sources for autoconf
| make[2]: Entering directory `/disk0/pokybuild/build-multilib-x32-qemu/tmp/work/x86_64-x32-poky-linux-gnux32/mesa-dri-7.10.2-r1/Mesa-7.10.2/src/mapi/glapi&apos;
| make[2]: Nothing to be done for `default&apos;.
| make[2]: Leaving directory `/disk0/pokybuild/build-multilib-x32-qemu/tmp/work/x86_64-x32-poky-linux-gnux32/mesa-dri-7.10.2-r1/Mesa-7.10.2/src/mapi/glapi&apos;
| make[2]: Entering directory `/disk0/pokybuild/build-multilib-x32-qemu/tmp/work/x86_64-x32-poky-linux-gnux32/mesa-dri-7.10.2-r1/Mesa-7.10.2/src/glsl&apos;
| make[2]: Nothing to be done for `default&apos;.
| make[2]: Leaving directory `/disk0/pokybuild/build-multilib-x32-qemu/tmp/work/x86_64-x32-poky-linux-gnux32/mesa-dri-7.10.2-r1/Mesa-7.10.2/src/glsl&apos;
| make[2]: Entering directory `/disk0/pokybuild/build-multilib-x32-qemu/tmp/work/x86_64-x32-poky-linux-gnux32/mesa-dri-7.10.2-r1/Mesa-7.10.2/src/mesa&apos;
| make[3]: Entering directory `/disk0/pokybuild/build-multilib-x32-qemu/tmp/work/x86_64-x32-poky-linux-gnux32/mesa-dri-7.10.2-r1/Mesa-7.10.2/src/mesa/drivers&apos;
| make[4]: Entering directory `/disk0/pokybuild/build-multilib-x32-qemu/tmp/work/x86_64-x32-poky-linux-gnux32/mesa-dri-7.10.2-r1/Mesa-7.10.2/src/mesa/drivers/dri&apos;
| make[5]: Entering directory `/disk0/pokybuild/build-multilib-x32-qemu/tmp/work/x86_64-x32-poky-linux-gnux32/mesa-dri-7.10.2-r1/Mesa-7.10.2/src/mesa/drivers/dri/i915&apos;
| make[6]: Entering directory `/disk0/pokybuild/build-multilib-x32-qemu/tmp/work/x86_64-x32-poky-linux-gnux32/mesa-dri-7.10.2-r1/Mesa-7.10.2/src/mesa/drivers/dri/i915&apos;
| /bin/sh ../../../../../bin/mklib -o i915_dri.so.tmp -noprefix -linker &apos;ccache x86_64-poky-linux-gnux32-g++   -mx32  --sysroot=/disk0/pokybuild/build-multilib-x32-qemu/tmp/sysroots/qemux86-64&apos; -ldflags &apos;-Wl,-O1 -Wl,--hash-style=gnu -Wl,--as-needed&apos; \
| 	../common/utils.o ../common/vblank.o ../common/dri_util.o ../common/xmlconfig.o ../../common/driverfuncs.o ../common/texmem.o ../common/drirenderbuffer.o ../common/dri_metaops.o i830_context.o i830_state.o i830_texblend.o i830_texstate.o i830_vtbl.o intel_render.o intel_regions.o intel_buffer_objects.o intel_batchbuffer.o intel_clear.o intel_extensions.o intel_extensions_es2.o intel_mipmap_tree.o intel_tex_layout.o intel_tex_image.o intel_tex_subimage.o intel_tex_copy.o intel_tex_validate.o intel_tex_format.o intel_tex.o intel_pixel.o intel_pixel_bitmap.o intel_pixel_copy.o intel_pixel_draw.o intel_pixel_read.o intel_buffers.o intel_blit.o i915_tex_layout.o i915_texstate.o i915_context.o i915_debug.o i915_debug_fp.o i915_fragprog.o i915_program.o i915_state.o i915_vtbl.o intel_context.o intel_decode.o intel_screen.o intel_span.o intel_state.o intel_syncobj.o intel_tris.o intel_fbo.o    ../../../../../src/mesa/libmesa.a    -ldrm   -lexpat -lm -lpthread -ldl -ldrm_intel -ldrm
| mklib: Making Linux shared library:  i915_dri.so.tmp
| /disk0/pokybuild/build-multilib-x32-qemu/tmp/sysroots/x86_64-linux/usr/libexec/x86_64-x32-poky-linux-gnux32/gcc/x86_64-poky-linux-gnux32/4.7.0/ld: skipping incompatible /disk0/pokybuild/build-multilib-x32-qemu/tmp/sysroots/qemux86-64/usr/lib/../lib/libdrm.so when searching for -ldrm
| /disk0/pokybuild/build-multilib-x32-qemu/tmp/sysroots/x86_64-linux/usr/libexec/x86_64-x32-poky-linux-gnux32/gcc/x86_64-poky-linux-gnux32/4.7.0/ld: skipping incompatible /disk0/pokybuild/build-multilib-x32-qemu/tmp/sysroots/qemux86-64/usr/lib/libdrm.so when searching for -ldrm
| /disk0/pokybuild/build-multilib-x32-qemu/tmp/sysroots/x86_64-linux/usr/libexec/x86_64-x32-poky-linux-gnux32/gcc/x86_64-poky-linux-gnux32/4.7.0/ld: skipping incompatible /disk0/pokybuild/build-multilib-x32-qemu/tmp/sysroots/qemux86-64/usr/lib/libdrm.so when searching for -ldrm
| /disk0/pokybuild/build-multilib-x32-qemu/tmp/sysroots/x86_64-linux/usr/libexec/x86_64-x32-poky-linux-gnux32/gcc/x86_64-poky-linux-gnux32/4.7.0/ld: cannot find -ldrm
| /disk0/pokybuild/build-multilib-x32-qemu/tmp/sysroots/x86_64-linux/usr/libexec/x86_64-x32-poky-linux-gnux32/gcc/x86_64-poky-linux-gnux32/4.7.0/ld: skipping incompatible /disk0/pokybuild/build-multilib-x32-qemu/tmp/sysroots/qemux86-64/usr/lib/../lib/libexpat.so when searching for -lexpat
| /disk0/pokybuild/build-multilib-x32-qemu/tmp/sysroots/x86_64-linux/usr/libexec/x86_64-x32-poky-linux-gnux32/gcc/x86_64-poky-linux-gnux32/4.7.0/ld: skipping incompatible /disk0/pokybuild/build-multilib-x32-qemu/tmp/sysroots/qemux86-64/usr/lib/../lib/libexpat.a when searching for -lexpat
| /disk0/pokybuild/build-multilib-x32-qemu/tmp/sysroots/x86_64-linux/usr/libexec/x86_64-x32-poky-linux-gnux32/gcc/x86_64-poky-linux-gnux32/4.7.0/ld: skipping incompatible /disk0/pokybuild/build-multilib-x32-qemu/tmp/sysroots/qemux86-64/usr/lib/libexpat.so when searching for -lexpat
| /disk0/pokybuild/build-multilib-x32-qemu/tmp/sysroots/x86_64-linux/usr/libexec/x86_64-x32-poky-linux-gnux32/gcc/x86_64-poky-linux-gnux32/4.7.0/ld: skipping incompatible /disk0/pokybuild/build-multilib-x32-qemu/tmp/sysroots/qemux86-64/usr/lib/libexpat.a when searching for -lexpat
| /disk0/pokybuild/build-multilib-x32-qemu/tmp/sysroots/x86_64-linux/usr/libexec/x86_64-x32-poky-linux-gnux32/gcc/x86_64-poky-linux-gnux32/4.7.0/ld: skipping incompatible /disk0/pokybuild/build-multilib-x32-qemu/tmp/sysroots/qemux86-64/usr/lib/libexpat.so when searching for -lexpat
| /disk0/pokybuild/build-multilib-x32-qemu/tmp/sysroots/x86_64-linux/usr/libexec/x86_64-x32-poky-linux-gnux32/gcc/x86_64-poky-linux-gnux32/4.7.0/ld: skipping incompatible /disk0/pokybuild/build-multilib-x32-qemu/tmp/sysroots/qemux86-64/usr/lib/libexpat.a when searching for -lexpat
| /disk0/pokybuild/build-multilib-x32-qemu/tmp/sysroots/x86_64-linux/usr/libexec/x86_64-x32-poky-linux-gnux32/gcc/x86_64-poky-linux-gnux32/4.7.0/ld: cannot find -lexpat
| /disk0/pokybuild/build-multilib-x32-qemu/tmp/sysroots/x86_64-linux/usr/libexec/x86_64-x32-poky-linux-gnux32/gcc/x86_64-poky-linux-gnux32/4.7.0/ld: skipping incompatible /disk0/pokybuild/build-multilib-x32-qemu/tmp/sysroots/qemux86-64/usr/lib/../lib/libpthread.so when searching for -lpthread
| /disk0/pokybuild/build-multilib-x32-qemu/tmp/sysroots/x86_64-linux/usr/libexec/x86_64-x32-poky-linux-gnux32/gcc/x86_64-poky-linux-gnux32/4.7.0/ld: skipping incompatible /disk0/pokybuild/build-multilib-x32-qemu/tmp/sysroots/qemux86-64/usr/lib/../lib/libpthread.a when searching for -lpthread
| /disk0/pokybuild/build-multilib-x32-qemu/tmp/sysroots/x86_64-linux/usr/libexec/x86_64-x32-poky-linux-gnux32/gcc/x86_64-poky-linux-gnux32/4.7.0/ld: skipping incompatible /disk0/pokybuild/build-multilib-x32-qemu/tmp/sysroots/qemux86-64/usr/lib/libpthread.so when searching for -lpthread
| /disk0/pokybuild/build-multilib-x32-qemu/tmp/sysroots/x86_64-linux/usr/libexec/x86_64-x32-poky-linux-gnux32/gcc/x86_64-poky-linux-gnux32/4.7.0/ld: skipping incompatible /disk0/pokybuild/build-multilib-x32-qemu/tmp/sysroots/qemux86-64/usr/lib/libpthread.a when searching for -lpthread
| /disk0/pokybuild/build-multilib-x32-qemu/tmp/sysroots/x86_64-linux/usr/libexec/x86_64-x32-poky-linux-gnux32/gcc/x86_64-poky-linux-gnux32/4.7.0/ld: skipping incompatible /disk0/pokybuild/build-multilib-x32-qemu/tmp/sysroots/qemux86-64/usr/lib/libpthread.so when searching for -lpthread
| /disk0/pokybuild/build-multilib-x32-qemu/tmp/sysroots/x86_64-linux/usr/libexec/x86_64-x32-poky-linux-gnux32/gcc/x86_64-poky-linux-gnux32/4.7.0/ld: skipping incompatible /disk0/pokybuild/build-multilib-x32-qemu/tmp/sysroots/qemux86-64/usr/lib/libpthread.a when searching for -lpthread
| /disk0/pokybuild/build-multilib-x32-qemu/tmp/sysroots/x86_64-linux/usr/libexec/x86_64-x32-poky-linux-gnux32/gcc/x86_64-poky-linux-gnux32/4.7.0/ld: cannot find -lpthread
| /disk0/pokybuild/build-multilib-x32-qemu/tmp/sysroots/x86_64-linux/usr/libexec/x86_64-x32-poky-linux-gnux32/gcc/x86_64-poky-linux-gnux32/4.7.0/ld: skipping incompatible /disk0/pokybuild/build-multilib-x32-qemu/tmp/sysroots/qemux86-64/usr/lib/../lib/libdl.so when searching for -ldl
| /disk0/pokybuild/build-multilib-x32-qemu/tmp/sysroots/x86_64-linux/usr/libexec/x86_64-x32-poky-linux-gnux32/gcc/x86_64-poky-linux-gnux32/4.7.0/ld: skipping incompatible /disk0/pokybuild/build-multilib-x32-qemu/tmp/sysroots/qemux86-64/usr/lib/../lib/libdl.a when searching for -ldl
| /disk0/pokybuild/build-multilib-x32-qemu/tmp/sysroots/x86_64-linux/usr/libexec/x86_64-x32-poky-linux-gnux32/gcc/x86_64-poky-linux-gnux32/4.7.0/ld: skipping incompatible /disk0/pokybuild/build-multilib-x32-qemu/tmp/sysroots/qemux86-64/usr/lib/libdl.so when searching for -ldl
| /disk0/pokybuild/build-multilib-x32-qemu/tmp/sysroots/x86_64-linux/usr/libexec/x86_64-x32-poky-linux-gnux32/gcc/x86_64-poky-linux-gnux32/4.7.0/ld: skipping incompatible /disk0/pokybuild/build-multilib-x32-qemu/tmp/sysroots/qemux86-64/usr/lib/libdl.a when searching for -ldl
| /disk0/pokybuild/build-multilib-x32-qemu/tmp/sysroots/x86_64-linux/usr/libexec/x86_64-x32-poky-linux-gnux32/gcc/x86_64-poky-linux-gnux32/4.7.0/ld: skipping incompatible /disk0/pokybuild/build-multilib-x32-qemu/tmp/sysroots/qemux86-64/usr/lib/libdl.so when searching for -ldl
| /disk0/pokybuild/build-multilib-x32-qemu/tmp/sysroots/x86_64-linux/usr/libexec/x86_64-x32-poky-linux-gnux32/gcc/x86_64-poky-linux-gnux32/4.7.0/ld: skipping incompatible /disk0/pokybuild/build-multilib-x32-qemu/tmp/sysroots/qemux86-64/usr/lib/libdl.a when searching for -ldl
| /disk0/pokybuild/build-multilib-x32-qemu/tmp/sysroots/x86_64-linux/usr/libexec/x86_64-x32-poky-linux-gnux32/gcc/x86_64-poky-linux-gnux32/4.7.0/ld: cannot find -ldl
| /disk0/pokybuild/build-multilib-x32-qemu/tmp/sysroots/x86_64-linux/usr/libexec/x86_64-x32-poky-linux-gnux32/gcc/x86_64-poky-linux-gnux32/4.7.0/ld: skipping incompatible /disk0/pokybuild/build-multilib-x32-qemu/tmp/sysroots/qemux86-64/usr/lib/../lib/libdrm_intel.so when searching for -ldrm_intel
| /disk0/pokybuild/build-multilib-x32-qemu/tmp/sysroots/x86_64-linux/usr/libexec/x86_64-x32-poky-linux-gnux32/gcc/x86_64-poky-linux-gnux32/4.7.0/ld: skipping incompatible /disk0/pokybuild/build-multilib-x32-qemu/tmp/sysroots/qemux86-64/usr/lib/libdrm_intel.so when searching for -ldrm_intel
| /disk0/pokybuild/build-multilib-x32-qemu/tmp/sysroots/x86_64-linux/usr/libexec/x86_64-x32-poky-linux-gnux32/gcc/x86_64-poky-linux-gnux32/4.7.0/ld: skipping incompatible /disk0/pokybuild/build-multilib-x32-qemu/tmp/sysroots/qemux86-64/usr/lib/libdrm_intel.so when searching for -ldrm_intel
| /disk0/pokybuild/build-multilib-x32-qemu/tmp/sysroots/x86_64-linux/usr/libexec/x86_64-x32-poky-linux-gnux32/gcc/x86_64-poky-linux-gnux32/4.7.0/ld: cannot find -ldrm_intel
| /disk0/pokybuild/build-multilib-x32-qemu/tmp/sysroots/x86_64-linux/usr/libexec/x86_64-x32-poky-linux-gnux32/gcc/x86_64-poky-linux-gnux32/4.7.0/ld: skipping incompatible /disk0/pokybuild/build-multilib-x32-qemu/tmp/sysroots/qemux86-64/usr/lib/../lib/libdrm.so when searching for -ldrm
| /disk0/pokybuild/build-multilib-x32-qemu/tmp/sysroots/x86_64-linux/usr/libexec/x86_64-x32-poky-linux-gnux32/gcc/x86_64-poky-linux-gnux32/4.7.0/ld: skipping incompatible /disk0/pokybuild/build-multilib-x32-qemu/tmp/sysroots/qemux86-64/usr/lib/libdrm.so when searching for -ldrm
| /disk0/pokybuild/build-multilib-x32-qemu/tmp/sysroots/x86_64-linux/usr/libexec/x86_64-x32-poky-linux-gnux32/gcc/x86_64-poky-linux-gnux32/4.7.0/ld: skipping incompatible /disk0/pokybuild/build-multilib-x32-qemu/tmp/sysroots/qemux86-64/usr/lib/libdrm.so when searching for -ldrm
| /disk0/pokybuild/build-multilib-x32-qemu/tmp/sysroots/x86_64-linux/usr/libexec/x86_64-x32-poky-linux-gnux32/gcc/x86_64-poky-linux-gnux32/4.7.0/ld: cannot find -ldrm
| /disk0/pokybuild/build-multilib-x32-qemu/tmp/sysroots/x86_64-linux/usr/libexec/x86_64-x32-poky-linux-gnux32/gcc/x86_64-poky-linux-gnux32/4.7.0/ld: skipping incompatible /disk0/pokybuild/build-multilib-x32-qemu/tmp/sysroots/qemux86-64/usr/lib/../lib/libstdc++.so when searching for -lstdc++
| /disk0/pokybuild/build-multilib-x32-qemu/tmp/sysroots/x86_64-linux/usr/libexec/x86_64-x32-poky-linux-gnux32/gcc/x86_64-poky-linux-gnux32/4.7.0/ld: skipping incompatible /disk0/pokybuild/build-multilib-x32-qemu/tmp/sysroots/qemux86-64/usr/lib/../lib/libstdc++.a when searching for -lstdc++
| /disk0/pokybuild/build-multilib-x32-qemu/tmp/sysroots/x86_64-linux/usr/libexec/x86_64-x32-poky-linux-gnux32/gcc/x86_64-poky-linux-gnux32/4.7.0/ld: skipping incompatible /disk0/pokybuild/build-multilib-x32-qemu/tmp/sysroots/qemux86-64/usr/lib/libstdc++.so when searching for -lstdc++
| /disk0/pokybuild/build-multilib-x32-qemu/tmp/sysroots/x86_64-linux/usr/libexec/x86_64-x32-poky-linux-gnux32/gcc/x86_64-poky-linux-gnux32/4.7.0/ld: skipping incompatible /disk0/pokybuild/build-multilib-x32-qemu/tmp/sysroots/qemux86-64/usr/lib/libstdc++.a when searching for -lstdc++
| /disk0/pokybuild/build-multilib-x32-qemu/tmp/sysroots/x86_64-linux/usr/libexec/x86_64-x32-poky-linux-gnux32/gcc/x86_64-poky-linux-gnux32/4.7.0/ld: skipping incompatible /disk0/pokybuild/build-multilib-x32-qemu/tmp/sysroots/qemux86-64/usr/lib/libstdc++.so when searching for -lstdc++
| /disk0/pokybuild/build-multilib-x32-qemu/tmp/sysroots/x86_64-linux/usr/libexec/x86_64-x32-poky-linux-gnux32/gcc/x86_64-poky-linux-gnux32/4.7.0/ld: skipping incompatible /disk0/pokybuild/build-multilib-x32-qemu/tmp/sysroots/qemux86-64/usr/lib/libstdc++.a when searching for -lstdc++
| /disk0/pokybuild/build-multilib-x32-qemu/tmp/sysroots/x86_64-linux/usr/libexec/x86_64-x32-poky-linux-gnux32/gcc/x86_64-poky-linux-gnux32/4.7.0/ld: cannot find -lstdc++
| /disk0/pokybuild/build-multilib-x32-qemu/tmp/sysroots/x86_64-linux/usr/libexec/x86_64-x32-poky-linux-gnux32/gcc/x86_64-poky-linux-gnux32/4.7.0/ld: skipping incompatible /disk0/pokybuild/build-multilib-x32-qemu/tmp/sysroots/qemux86-64/usr/lib/../lib/libm.so when searching for -lm
| /disk0/pokybuild/build-multilib-x32-qemu/tmp/sysroots/x86_64-linux/usr/libexec/x86_64-x32-poky-linux-gnux32/gcc/x86_64-poky-linux-gnux32/4.7.0/ld: skipping incompatible /disk0/pokybuild/build-multilib-x32-qemu/tmp/sysroots/qemux86-64/usr/lib/../lib/libm.a when searching for -lm
| /disk0/pokybuild/build-multilib-x32-qemu/tmp/sysroots/x86_64-linux/usr/libexec/x86_64-x32-poky-linux-gnux32/gcc/x86_64-poky-linux-gnux32/4.7.0/ld: skipping incompatible /disk0/pokybuild/build-multilib-x32-qemu/tmp/sysroots/qemux86-64/usr/lib/libm.so when searching for -lm
| /disk0/pokybuild/build-multilib-x32-qemu/tmp/sysroots/x86_64-linux/usr/libexec/x86_64-x32-poky-linux-gnux32/gcc/x86_64-poky-linux-gnux32/4.7.0/ld: skipping incompatible /disk0/pokybuild/build-multilib-x32-qemu/tmp/sysroots/qemux86-64/usr/lib/libm.a when searching for -lm
| /disk0/pokybuild/build-multilib-x32-qemu/tmp/sysroots/x86_64-linux/usr/libexec/x86_64-x32-poky-linux-gnux32/gcc/x86_64-poky-linux-gnux32/4.7.0/ld: skipping incompatible /disk0/pokybuild/build-multilib-x32-qemu/tmp/sysroots/qemux86-64/usr/lib/libm.so when searching for -lm
| /disk0/pokybuild/build-multilib-x32-qemu/tmp/sysroots/x86_64-linux/usr/libexec/x86_64-x32-poky-linux-gnux32/gcc/x86_64-poky-linux-gnux32/4.7.0/ld: skipping incompatible /disk0/pokybuild/build-multilib-x32-qemu/tmp/sysroots/qemux86-64/usr/lib/libm.a when searching for -lm
| /disk0/pokybuild/build-multilib-x32-qemu/tmp/sysroots/x86_64-linux/usr/libexec/x86_64-x32-poky-linux-gnux32/gcc/x86_64-poky-linux-gnux32/4.7.0/ld: cannot find -lm
| /disk0/pokybuild/build-multilib-x32-qemu/tmp/sysroots/x86_64-linux/usr/libexec/x86_64-x32-poky-linux-gnux32/gcc/x86_64-poky-linux-gnux32/4.7.0/ld: skipping incompatible /disk0/pokybuild/build-multilib-x32-qemu/tmp/sysroots/qemux86-64/lib/../lib/libgcc_s.so when searching for -lgcc_s
| /disk0/pokybuild/build-multilib-x32-qemu/tmp/sysroots/x86_64-linux/usr/libexec/x86_64-x32-poky-linux-gnux32/gcc/x86_64-poky-linux-gnux32/4.7.0/ld: skipping incompatible /disk0/pokybuild/build-multilib-x32-qemu/tmp/sysroots/qemux86-64/lib/libgcc_s.so when searching for -lgcc_s
| /disk0/pokybuild/build-multilib-x32-qemu/tmp/sysroots/x86_64-linux/usr/libexec/x86_64-x32-poky-linux-gnux32/gcc/x86_64-poky-linux-gnux32/4.7.0/ld: skipping incompatible /disk0/pokybuild/build-multilib-x32-qemu/tmp/sysroots/qemux86-64/lib/libgcc_s.so when searching for -lgcc_s
| /disk0/pokybuild/build-multilib-x32-qemu/tmp/sysroots/x86_64-linux/usr/libexec/x86_64-x32-poky-linux-gnux32/gcc/x86_64-poky-linux-gnux32/4.7.0/ld: cannot find -lgcc_s
| /disk0/pokybuild/build-multilib-x32-qemu/tmp/sysroots/x86_64-linux/usr/libexec/x86_64-x32-poky-linux-gnux32/gcc/x86_64-poky-linux-gnux32/4.7.0/ld: skipping incompatible /disk0/pokybuild/build-multilib-x32-qemu/tmp/sysroots/qemux86-64/usr/lib/../lib/libc.so when searching for -lc
| /disk0/pokybuild/build-multilib-x32-qemu/tmp/sysroots/x86_64-linux/usr/libexec/x86_64-x32-poky-linux-gnux32/gcc/x86_64-poky-linux-gnux32/4.7.0/ld: skipping incompatible /disk0/pokybuild/build-multilib-x32-qemu/tmp/sysroots/qemux86-64/usr/lib/../lib/libc.a when searching for -lc
| /disk0/pokybuild/build-multilib-x32-qemu/tmp/sysroots/x86_64-linux/usr/libexec/x86_64-x32-poky-linux-gnux32/gcc/x86_64-poky-linux-gnux32/4.7.0/ld: skipping incompatible /disk0/pokybuild/build-multilib-x32-qemu/tmp/sysroots/qemux86-64/usr/lib/libc.so when searching for -lc
| /disk0/pokybuild/build-multilib-x32-qemu/tmp/sysroots/x86_64-linux/usr/libexec/x86_64-x32-poky-linux-gnux32/gcc/x86_64-poky-linux-gnux32/4.7.0/ld: skipping incompatible /disk0/pokybuild/build-multilib-x32-qemu/tmp/sysroots/qemux86-64/usr/lib/libc.a when searching for -lc
| /disk0/pokybuild/build-multilib-x32-qemu/tmp/sysroots/x86_64-linux/usr/libexec/x86_64-x32-poky-linux-gnux32/gcc/x86_64-poky-linux-gnux32/4.7.0/ld: skipping incompatible /disk0/pokybuild/build-multilib-x32-qemu/tmp/sysroots/qemux86-64/usr/lib/libc.so when searching for -lc
| /disk0/pokybuild/build-multilib-x32-qemu/tmp/sysroots/x86_64-linux/usr/libexec/x86_64-x32-poky-linux-gnux32/gcc/x86_64-poky-linux-gnux32/4.7.0/ld: skipping incompatible /disk0/pokybuild/build-multilib-x32-qemu/tmp/sysroots/qemux86-64/usr/lib/libc.a when searching for -lc
| /disk0/pokybuild/build-multilib-x32-qemu/tmp/sysroots/x86_64-linux/usr/libexec/x86_64-x32-poky-linux-gnux32/gcc/x86_64-poky-linux-gnux32/4.7.0/ld: cannot find -lc
| /disk0/pokybuild/build-multilib-x32-qemu/tmp/sysroots/x86_64-linux/usr/libexec/x86_64-x32-poky-linux-gnux32/gcc/x86_64-poky-linux-gnux32/4.7.0/ld: skipping incompatible /disk0/pokybuild/build-multilib-x32-qemu/tmp/sysroots/qemux86-64/lib/../lib/libgcc_s.so when searching for -lgcc_s
| /disk0/pokybuild/build-multilib-x32-qemu/tmp/sysroots/x86_64-linux/usr/libexec/x86_64-x32-poky-linux-gnux32/gcc/x86_64-poky-linux-gnux32/4.7.0/ld: skipping incompatible /disk0/pokybuild/build-multilib-x32-qemu/tmp/sysroots/qemux86-64/lib/libgcc_s.so when searching for -lgcc_s
| /disk0/pokybuild/build-multilib-x32-qemu/tmp/sysroots/x86_64-linux/usr/libexec/x86_64-x32-poky-linux-gnux32/gcc/x86_64-poky-linux-gnux32/4.7.0/ld: skipping incompatible /disk0/pokybuild/build-multilib-x32-qemu/tmp/sysroots/qemux86-64/lib/libgcc_s.so when searching for -lgcc_s
| /disk0/pokybuild/build-multilib-x32-qemu/tmp/sysroots/x86_64-linux/usr/libexec/x86_64-x32-poky-linux-gnux32/gcc/x86_64-poky-linux-gnux32/4.7.0/ld: cannot find -lgcc_s
| collect2: error: ld returned 1 exit status
| ccache x86_64-poky-linux-gnux32-g++   -mx32  --sysroot=/disk0/pokybuild/build-multilib-x32-qemu/tmp/sysroots/qemux86-64 -O2 -pipe -g -feliminate-unused-debug-types -Wall -Wmissing-prototypes -std=c99 -ffast-math -fvisibility=hidden -fno-strict-aliasing  -fPIC   -D_GNU_SOURCE -DPTHREADS -DHAVE_POSIX_MEMALIGN -DGLX_USE_TLS -DPTHREADS -DUSE_EXTERNAL_DXTN_LIB=1 -DIN_DRI_DRIVER -DGLX_DIRECT_RENDERING -DGLX_INDIRECT_RENDERING -DHAVE_ALIAS -DFEATURE_GL=1 -o i915_dri.so.test ../../../../../src/mesa/drivers/dri/common/dri_test.o i915_dri.so.tmp   -ldrm   -lexpat -lm -lpthread -ldl -ldrm_intel -ldrm
| x86_64-poky-linux-gnux32-g++: error: i915_dri.so.tmp: No such file or directory
| make[6]: *** [i915_dri.so] Error 1
| make[6]: Leaving directory `/disk0/pokybuild/build-multilib-x32-qemu/tmp/work/x86_64-x32-poky-linux-gnux32/mesa-dri-7.10.2-r1/Mesa-7.10.2/src/mesa/drivers/dri/i915&apos;
| make[5]: *** [lib] Error 2
| make[5]: Leaving directory `/disk0/pokybuild/build-multilib-x32-qemu/tmp/work/x86_64-x32-poky-linux-gnux32/mesa-dri-7.10.2-r1/Mesa-7.10.2/src/mesa/drivers/dri/i915&apos;
| make[4]: *** [subdirs] Error 1
| make[4]: Leaving directory `/disk0/pokybuild/build-multilib-x32-qemu/tmp/work/x86_64-x32-poky-linux-gnux32/mesa-dri-7.10.2-r1/Mesa-7.10.2/src/mesa/drivers/dri&apos;
| make[3]: *** [default] Error 1
| make[3]: Leaving directory `/disk0/pokybuild/build-multilib-x32-qemu/tmp/work/x86_64-x32-poky-linux-gnux32/mesa-dri-7.10.2-r1/Mesa-7.10.2/src/mesa/drivers&apos;
| make[2]: *** [driver_subdirs] Error 2
| make[2]: Leaving directory `/disk0/pokybuild/build-multilib-x32-qemu/tmp/work/x86_64-x32-poky-linux-gnux32/mesa-dri-7.10.2-r1/Mesa-7.10.2/src/mesa&apos;
| make[1]: *** [subdirs] Error 1
| make[1]: Leaving directory `/disk0/pokybuild/build-multilib-x32-qemu/tmp/work/x86_64-x32-poky-linux-gnux32/mesa-dri-7.10.2-r1/Mesa-7.10.2/src&apos;
| make: *** [default] Error 1
| ERROR: oe_runmake failed
| ERROR: Function &apos;do_compile&apos; failed (see /disk0/pokybuild/build-multilib-x32-qemu/tmp/work/x86_64-x32-poky-linux-gnux32/mesa-dri-7.10.2-r1/temp/log.do_compile.6772 for further information)</thetext>
  </long_desc><long_desc isprivate="0" >
    <commentid>16073</commentid>
    <comment_count>1</comment_count>
    <who name="wenhua.fan">wenhuax.fan</who>
    <bug_when>2011-09-07 02:50:32 +0000</bug_when>
    <thetext>This issue appear also in 20110907 build on autobuilder.

Commit information:

Tree/Branch: Poky/Master
Commit id: 45416a04123a46ce0a35c6b9286bf53f2f8ce257
Meta branch: Master
Commit id: dbff56238e083d0110eb13c1f5a07716340fdfe4

Detail information please refer to http://autobuilder.yoctoproject.org:8010/builders/nightly-x86/builds/76/steps/shell_55/logs/stdio</thetext>
  </long_desc><long_desc isprivate="0" >
    <commentid>16075</commentid>
    <comment_count>2</comment_count>
    <who name="Jiajun Xu">jiajun.xu</who>
    <bug_when>2011-09-07 08:33:12 +0000</bug_when>
    <thetext>(In reply to comment #1)
&gt; This issue appear also in 20110907 build on autobuilder.
&gt; Commit information:
&gt; Tree/Branch: Poky/Master
&gt; Commit id: 45416a04123a46ce0a35c6b9286bf53f2f8ce257
&gt; Meta branch: Master
&gt; Commit id: dbff56238e083d0110eb13c1f5a07716340fdfe4
&gt; Detail information please refer to
&gt; http://autobuilder.yoctoproject.org:8010/builders/nightly-x86/builds/76/steps/shell_55/logs/stdio

Totally different error message on current autobuilder, pls. ignore Wenhua&apos;s comments above.</thetext>
  </long_desc><long_desc isprivate="0" >
    <commentid>17462</commentid>
    <comment_count>3</comment_count>
    <who name="Nitin Kamble">nitin.a.kamble</who>
    <bug_when>2011-12-01 14:59:37 +0000</bug_when>
    <thetext>this issue does not happen on the latest meta-x32 layer.
Nitin</thetext>
  </long_desc>
      
      

    </bug>

</bugzilla>