<?xml version="1.0" encoding="UTF-8" standalone="yes" ?>
<!DOCTYPE bugzilla SYSTEM "https://bugzilla.yoctoproject.org/page.cgi?id=bugzilla.dtd">

<bugzilla version="5.0.6"
          urlbase="https://bugzilla.yoctoproject.org/"
          
          maintainer="it-coreprojects-helpdesk@linuxfoundation.org"
>

    <bug>
          <bug_id>1416</bug_id>
          
          <creation_ts>2011-08-25 14:43:02 +0000</creation_ts>
          <short_desc>x32: hal building fails</short_desc>
          <delta_ts>2011-12-01 15:01:14 +0000</delta_ts>
          <reporter_accessible>1</reporter_accessible>
          <cclist_accessible>1</cclist_accessible>
          <classification_id>7</classification_id>
          <classification>Build System, Metadata &amp; Runtime</classification>
          <product>OE-Core</product>
          <component>core</component>
          <version>unspecified</version>
          <rep_platform>x86</rep_platform>
          <op_sys>x86_64</op_sys>
          <bug_status>RESOLVED</bug_status>
          <resolution>INVALID</resolution>
          
          
          <bug_file_loc></bug_file_loc>
          <status_whiteboard></status_whiteboard>
          <keywords></keywords>
          <priority>Medium</priority>
          <bug_severity>normal</bug_severity>
          <target_milestone>1.2</target_milestone>
          
          <blocked>1579</blocked>
          <everconfirmed>1</everconfirmed>
          <reporter name="Nitin Kamble">nitin.a.kamble</reporter>
          <assigned_to name="Nitin Kamble">nitin.a.kamble</assigned_to>
          <cc>hjl.tools</cc>
    
    <cc>meta.mr.watcher</cc>
    
    <cc>meta.watcher</cc>
          
          
          <cf_os>---</cf_os>
          <cf_regression_type>---</cf_regression_type>
          
          <cf_docchange>---</cf_docchange>

      

      

      

          <comment_sort_order>oldest_to_newest</comment_sort_order>  
          <long_desc isprivate="0" >
    <commentid>15781</commentid>
    <comment_count>0</comment_count>
    <who name="Nitin Kamble">nitin.a.kamble</who>
    <bug_when>2011-08-25 14:43:02 +0000</bug_when>
    <thetext>ERROR: Function &apos;do_compile&apos; failed (see /disk0/pokybuild/build-multilib-x32-qemu/tmp/work/x86_64-x32-poky-linux-gnux32/hal-0.5.14-r4/temp/log.do_compile.6862 for further information)
ERROR: Logfile of failure stored in: /disk0/pokybuild/build-multilib-x32-qemu/tmp/work/x86_64-x32-poky-linux-gnux32/hal-0.5.14-r4/temp/log.do_compile.6862
Log data follows:
| DEBUG: SITE files [&apos;endian-little&apos;, &apos;common-linux&apos;, &apos;common-glibc&apos;, &apos;bit-32&apos;, &apos;ix86-common&apos;, &apos;x86_64-linux-gnux32&apos;, &apos;common&apos;]
| NOTE: make -j 16 -e udevrulesdir=$(sysconfdir)/udev/rules.d
| make  all-recursive
| make[1]: Entering directory `/disk0/pokybuild/build-multilib-x32-qemu/tmp/work/x86_64-x32-poky-linux-gnux32/hal-0.5.14-r4/hal-0.5.14&apos;
| Making all in libhal
| make[2]: Entering directory `/disk0/pokybuild/build-multilib-x32-qemu/tmp/work/x86_64-x32-poky-linux-gnux32/hal-0.5.14-r4/hal-0.5.14/libhal&apos;
| make[2]: Nothing to be done for `all&apos;.
| make[2]: Leaving directory `/disk0/pokybuild/build-multilib-x32-qemu/tmp/work/x86_64-x32-poky-linux-gnux32/hal-0.5.14-r4/hal-0.5.14/libhal&apos;
| Making all in libhal-storage
| make[2]: Entering directory `/disk0/pokybuild/build-multilib-x32-qemu/tmp/work/x86_64-x32-poky-linux-gnux32/hal-0.5.14-r4/hal-0.5.14/libhal-storage&apos;
| make[2]: Nothing to be done for `all&apos;.
| make[2]: Leaving directory `/disk0/pokybuild/build-multilib-x32-qemu/tmp/work/x86_64-x32-poky-linux-gnux32/hal-0.5.14-r4/hal-0.5.14/libhal-storage&apos;
| Making all in partutil
| make[2]: Entering directory `/disk0/pokybuild/build-multilib-x32-qemu/tmp/work/x86_64-x32-poky-linux-gnux32/hal-0.5.14-r4/hal-0.5.14/partutil&apos;
| make[2]: Nothing to be done for `all&apos;.
| make[2]: Leaving directory `/disk0/pokybuild/build-multilib-x32-qemu/tmp/work/x86_64-x32-poky-linux-gnux32/hal-0.5.14-r4/hal-0.5.14/partutil&apos;
| Making all in hald
| make[2]: Entering directory `/disk0/pokybuild/build-multilib-x32-qemu/tmp/work/x86_64-x32-poky-linux-gnux32/hal-0.5.14-r4/hal-0.5.14/hald&apos;
| make  all-recursive
| make[3]: Entering directory `/disk0/pokybuild/build-multilib-x32-qemu/tmp/work/x86_64-x32-poky-linux-gnux32/hal-0.5.14-r4/hal-0.5.14/hald&apos;
| Making all in dummy
| make[4]: Entering directory `/disk0/pokybuild/build-multilib-x32-qemu/tmp/work/x86_64-x32-poky-linux-gnux32/hal-0.5.14-r4/hal-0.5.14/hald/dummy&apos;
| make[4]: Nothing to be done for `all&apos;.
| make[4]: Leaving directory `/disk0/pokybuild/build-multilib-x32-qemu/tmp/work/x86_64-x32-poky-linux-gnux32/hal-0.5.14-r4/hal-0.5.14/hald/dummy&apos;
| Making all in freebsd
| make[4]: Entering directory `/disk0/pokybuild/build-multilib-x32-qemu/tmp/work/x86_64-x32-poky-linux-gnux32/hal-0.5.14-r4/hal-0.5.14/hald/freebsd&apos;
| Making all in libprobe
| make[5]: Entering directory `/disk0/pokybuild/build-multilib-x32-qemu/tmp/work/x86_64-x32-poky-linux-gnux32/hal-0.5.14-r4/hal-0.5.14/hald/freebsd/libprobe&apos;
| make[5]: Nothing to be done for `all&apos;.
| make[5]: Leaving directory `/disk0/pokybuild/build-multilib-x32-qemu/tmp/work/x86_64-x32-poky-linux-gnux32/hal-0.5.14-r4/hal-0.5.14/hald/freebsd/libprobe&apos;
| Making all in probing
| make[5]: Entering directory `/disk0/pokybuild/build-multilib-x32-qemu/tmp/work/x86_64-x32-poky-linux-gnux32/hal-0.5.14-r4/hal-0.5.14/hald/freebsd/probing&apos;
| make[5]: Nothing to be done for `all&apos;.
| make[5]: Leaving directory `/disk0/pokybuild/build-multilib-x32-qemu/tmp/work/x86_64-x32-poky-linux-gnux32/hal-0.5.14-r4/hal-0.5.14/hald/freebsd/probing&apos;
| Making all in addons
| make[5]: Entering directory `/disk0/pokybuild/build-multilib-x32-qemu/tmp/work/x86_64-x32-poky-linux-gnux32/hal-0.5.14-r4/hal-0.5.14/hald/freebsd/addons&apos;
| make[5]: Nothing to be done for `all&apos;.
| make[5]: Leaving directory `/disk0/pokybuild/build-multilib-x32-qemu/tmp/work/x86_64-x32-poky-linux-gnux32/hal-0.5.14-r4/hal-0.5.14/hald/freebsd/addons&apos;
| Making all in .
| make[5]: Entering directory `/disk0/pokybuild/build-multilib-x32-qemu/tmp/work/x86_64-x32-poky-linux-gnux32/hal-0.5.14-r4/hal-0.5.14/hald/freebsd&apos;
| make[5]: Nothing to be done for `all-am&apos;.
| make[5]: Leaving directory `/disk0/pokybuild/build-multilib-x32-qemu/tmp/work/x86_64-x32-poky-linux-gnux32/hal-0.5.14-r4/hal-0.5.14/hald/freebsd&apos;
| make[4]: Leaving directory `/disk0/pokybuild/build-multilib-x32-qemu/tmp/work/x86_64-x32-poky-linux-gnux32/hal-0.5.14-r4/hal-0.5.14/hald/freebsd&apos;
| Making all in linux
| make[4]: Entering directory `/disk0/pokybuild/build-multilib-x32-qemu/tmp/work/x86_64-x32-poky-linux-gnux32/hal-0.5.14-r4/hal-0.5.14/hald/linux&apos;
| Making all in probing
| make[5]: Entering directory `/disk0/pokybuild/build-multilib-x32-qemu/tmp/work/x86_64-x32-poky-linux-gnux32/hal-0.5.14-r4/hal-0.5.14/hald/linux/probing&apos;
| ccache x86_64-poky-linux-gnux32-gcc   -mx32  --sysroot=/disk0/pokybuild/build-multilib-x32-qemu/tmp/sysroots/qemux86-64 -DHAVE_CONFIG_H -I. -I../../..  -DPACKAGE_SYSCONF_DIR=\&quot;&quot;/etc&quot;\&quot; -DPACKAGE_DATA_DIR=\&quot;&quot;/usr/share&quot;\&quot; -DPACKAGE_BIN_DIR=\&quot;&quot;/usr/bin&quot;\&quot; -DPACKAGE_LOCALE_DIR=\&quot;&quot;/usr/share/locale&quot;\&quot; -DPACKAGE_LOCALSTATEDIR=\&quot;&quot;/var&quot;\&quot; -I../../.. -pthread -I/disk0/pokybuild/build-multilib-x32-qemu/tmp/sysroots/qemux86-64/usr/include/glib-2.0 -I/disk0/pokybuild/build-multilib-x32-qemu/tmp/sysroots/qemux86-64/usr/lib/glib-2.0/include -I/disk0/pokybuild/build-multilib-x32-qemu/tmp/sysroots/qemux86-64/usr/include/dbus-1.0 -I/disk0/pokybuild/build-multilib-x32-qemu/tmp/sysroots/qemux86-64/usr/lib/dbus-1.0/include   -I/disk0/pokybuild/build-multilib-x32-qemu/tmp/sysroots/qemux86-64/usr/include/dbus-1.0 -I/disk0/pokybuild/build-multilib-x32-qemu/tmp/sysroots/qemux86-64/usr/lib/dbus-1.0/include   -I/disk0/pokybuild/build-multilib-x32-qemu/tmp/sysroots/qemux86-64/usr/include/blkid -I/disk0/pokybuild/build-multilib-x32-qemu/tmp/sysroots/qemux86-64/usr/include/uuid     -O2 -pipe -g -feliminate-unused-debug-types -MT probe-video4linux.o -MD -MP -MF .deps/probe-video4linux.Tpo -c -o probe-video4linux.o probe-video4linux.c
| probe-video4linux.c:33:28: fatal error: linux/videodev.h: No such file or directory
| compilation terminated.
| make[5]: *** [probe-video4linux.o] Error 1
| make[5]: Leaving directory `/disk0/pokybuild/build-multilib-x32-qemu/tmp/work/x86_64-x32-poky-linux-gnux32/hal-0.5.14-r4/hal-0.5.14/hald/linux/probing&apos;
| make[4]: *** [all-recursive] Error 1
| make[4]: Leaving directory `/disk0/pokybuild/build-multilib-x32-qemu/tmp/work/x86_64-x32-poky-linux-gnux32/hal-0.5.14-r4/hal-0.5.14/hald/linux&apos;
| make[3]: *** [all-recursive] Error 1
| make[3]: Leaving directory `/disk0/pokybuild/build-multilib-x32-qemu/tmp/work/x86_64-x32-poky-linux-gnux32/hal-0.5.14-r4/hal-0.5.14/hald&apos;
| make[2]: *** [all] Error 2
| make[2]: Leaving directory `/disk0/pokybuild/build-multilib-x32-qemu/tmp/work/x86_64-x32-poky-linux-gnux32/hal-0.5.14-r4/hal-0.5.14/hald&apos;
| make[1]: *** [all-recursive] Error 1
| make[1]: Leaving directory `/disk0/pokybuild/build-multilib-x32-qemu/tmp/work/x86_64-x32-poky-linux-gnux32/hal-0.5.14-r4/hal-0.5.14&apos;
| make: *** [all] Error 2
| ERROR: oe_runmake failed
| ERROR: Function &apos;do_compile&apos; failed (see /disk0/pokybuild/build-multilib-x32-qemu/tmp/work/x86_64-x32-poky-linux-gnux32/hal-0.5.14-r4/temp/log.do_compile.6862 for further information)
NOTE: package hal-0.5.14-r4: task do_compile: Failed</thetext>
  </long_desc><long_desc isprivate="0" >
    <commentid>17463</commentid>
    <comment_count>1</comment_count>
    <who name="Nitin Kamble">nitin.a.kamble</who>
    <bug_when>2011-12-01 15:01:14 +0000</bug_when>
    <thetext>As hal recipe is removed from the poky layer, closing this bug as invalid.</thetext>
  </long_desc>
      
      

    </bug>

</bugzilla>