<?xml version="1.0" encoding="UTF-8" standalone="yes" ?>
<!DOCTYPE bugzilla SYSTEM "https://bugzilla.yoctoproject.org/page.cgi?id=bugzilla.dtd">

<bugzilla version="5.0.6"
          urlbase="https://bugzilla.yoctoproject.org/"
          
          maintainer="it-coreprojects-helpdesk@linuxfoundation.org"
>

    <bug>
          <bug_id>14165</bug_id>
          
          <creation_ts>2020-12-28 07:44:35 +0000</creation_ts>
          <short_desc>AB-INT PTEST: strace ptest intermittent failure in qual_fault-syscall.test</short_desc>
          <delta_ts>2025-01-23 15:52:48 +0000</delta_ts>
          <reporter_accessible>1</reporter_accessible>
          <cclist_accessible>1</cclist_accessible>
          <classification_id>10</classification_id>
          <classification>QA/Testing</classification>
          <product>Package Testing (ptest)</product>
          <component>ptest</component>
          <version>3.3</version>
          <rep_platform>x86</rep_platform>
          <op_sys>arm64</op_sys>
          <bug_status>RESOLVED</bug_status>
          <resolution>WORKSFORME</resolution>
          
          
          <bug_file_loc></bug_file_loc>
          <status_whiteboard>AB-INT</status_whiteboard>
          <keywords></keywords>
          <priority>Medium</priority>
          <bug_severity>normal</bug_severity>
          <target_milestone>5.2</target_milestone>
          
          
          <everconfirmed>1</everconfirmed>
          <reporter name="Naveen Saini">naveen.kumar.saini</reporter>
          <assigned_to name="Randy MacLeod">randy.macleod</assigned_to>
          <cc>alexandre.belloni</cc>
    
    <cc>chee.yang.lee</cc>
    
    <cc>joaomarcos.costa</cc>
    
    <cc>jon.mason</cc>
    
    <cc>randy.macleod</cc>
    
    <cc>ross.burton</cc>
          
          
          <cf_os>---</cf_os>
          <cf_regression_type>---</cf_regression_type>
          
          <cf_docchange>No (bug/feature does not impact docs)</cf_docchange>

      

      

      

          <comment_sort_order>oldest_to_newest</comment_sort_order>  
          <long_desc isprivate="0" >
    <commentid>88826</commentid>
    <comment_count>0</comment_count>
    <who name="Naveen Saini">naveen.kumar.saini</who>
    <bug_when>2020-12-28 07:44:35 +0000</bug_when>
    <thetext>https://autobuilder.yoctoproject.org/typhoon/#/builders/82/builds/1359
https://autobuilder.yoctoproject.org/typhoon/#/builders/82/builds/1364

AssertionError: Failed ptests:
{&apos;strace&apos;: [&apos;qual_fault-syscall.test&apos;, &apos;qual_fault.test&apos;]}</thetext>
  </long_desc><long_desc isprivate="0" >
    <commentid>88872</commentid>
    <comment_count>1</comment_count>
    <who name="Naveen Saini">naveen.kumar.saini</who>
    <bug_when>2021-01-06 06:51:01 +0000</bug_when>
    <thetext>Observed same ptest failure with qemux86-64 too (master-next)

AssertionError: Failed ptests:
{&apos;strace&apos;: [&apos;qual_fault-syscall.test&apos;, &apos;qual_fault.test&apos;]}

https://autobuilder.yoctoproject.org/typhoon/#/builders/81/builds/1647</thetext>
  </long_desc><long_desc isprivate="0" >
    <commentid>88971</commentid>
    <comment_count>2</comment_count>
    <who name="Chee Yang">chee.yang.lee</who>
    <bug_when>2021-01-21 03:38:12 +0000</bug_when>
    <thetext>i think these should be same issue 
Worker: ubuntu2004-arm-1
master

WARNING: core-image-sato-sdk-ptest-1.0-r0 do_testimage: There were failing ptests.
Traceback (most recent call last):
  File &quot;/home/pokybuild/yocto-worker/qemuarm64-ptest/build/meta/lib/oeqa/core/decorator/__init__.py&quot;, line 36, in wrapped_f
    return func(*args, **kwargs)
  File &quot;/home/pokybuild/yocto-worker/qemuarm64-ptest/build/meta/lib/oeqa/core/decorator/__init__.py&quot;, line 36, in wrapped_f
    return func(*args, **kwargs)
  File &quot;/home/pokybuild/yocto-worker/qemuarm64-ptest/build/meta/lib/oeqa/core/decorator/__init__.py&quot;, line 36, in wrapped_f
    return func(*args, **kwargs)
  File &quot;/home/pokybuild/yocto-worker/qemuarm64-ptest/build/meta/lib/oeqa/runtime/cases/ptest.py&quot;, line 25, in test_ptestrunner_expectfail
    self.do_ptestrunner()
  File &quot;/home/pokybuild/yocto-worker/qemuarm64-ptest/build/meta/lib/oeqa/runtime/cases/ptest.py&quot;, line 112, in do_ptestrunner
    self.fail(failmsg)
AssertionError: Failed ptests:
{&apos;strace&apos;: [&apos;qual_fault.test&apos;]}

https://autobuilder.yoctoproject.org/typhoon/#/builders/82/builds/1439/steps/12/logs/stdio</thetext>
  </long_desc><long_desc isprivate="0" >
    <commentid>89034</commentid>
    <comment_count>3</comment_count>
    <who name="Yi Fan Yu">yf3yu</who>
    <bug_when>2021-01-26 19:40:54 +0000</bug_when>
    <thetext>tried to reproduce on qemux86-64:
tests/qual_fault.log:qual_fault.test: failed test: time limit (120) exceeded 

Attempted to raise the timeout limit to 1200s and test passed.

same for qual_fault_syscall</thetext>
  </long_desc><long_desc isprivate="0" >
    <commentid>89035</commentid>
    <comment_count>4</comment_count>
    <who name="Randy MacLeod">randy.macleod</who>
    <bug_when>2021-01-26 20:01:04 +0000</bug_when>
    <thetext>1200 s is a bit long. How about 2x the actual time required?</thetext>
  </long_desc><long_desc isprivate="0" >
    <commentid>89044</commentid>
    <comment_count>5</comment_count>
    <who name="Yi Fan Yu">yf3yu</who>
    <bug_when>2021-01-27 19:33:51 +0000</bug_when>
    <thetext>2x was implemented so 240s (4min) for timeout</thetext>
  </long_desc><long_desc isprivate="0" >
    <commentid>89045</commentid>
    <comment_count>6</comment_count>
    <who name="Randy MacLeod">randy.macleod</who>
    <bug_when>2021-01-27 20:08:27 +0000</bug_when>
    <thetext>Please add a link to the commit so that people can see the change for themselves.</thetext>
  </long_desc><long_desc isprivate="0" >
    <commentid>89047</commentid>
    <comment_count>7</comment_count>
    <who name="Yi Fan Yu">yf3yu</who>
    <bug_when>2021-01-27 20:44:49 +0000</bug_when>
    <thetext>https://git.openembedded.org/openembedded-core/commit/?id=5af9f32d9b12654793289f44366251f978f6378a</thetext>
  </long_desc><long_desc isprivate="0" >
    <commentid>89057</commentid>
    <comment_count>8</comment_count>
    <who name="Randy MacLeod">randy.macleod</who>
    <bug_when>2021-01-28 15:35:43 +0000</bug_when>
    <thetext>*** Bug 14197 has been marked as a duplicate of this bug. ***</thetext>
  </long_desc><long_desc isprivate="0" >
    <commentid>89059</commentid>
    <comment_count>9</comment_count>
    <who name="Randy MacLeod">randy.macleod</who>
    <bug_when>2021-01-28 15:36:16 +0000</bug_when>
    <thetext>*** Bug 14198 has been marked as a duplicate of this bug. ***</thetext>
  </long_desc><long_desc isprivate="0" >
    <commentid>90353</commentid>
    <comment_count>10</comment_count>
    <who name="Chee Yang">chee.yang.lee</who>
    <bug_when>2021-05-12 11:59:30 +0000</bug_when>
    <thetext>happened again 
 https://autobuilder.yoctoproject.org/typhoon/#/builders/81/builds/2079/steps/12/logs/stdio
qemux86-64-ptest
fedora33-ty-1</thetext>
  </long_desc><long_desc isprivate="0" >
    <commentid>90808</commentid>
    <comment_count>11</comment_count>
    <who name="Alexandre Belloni">alexandre.belloni</who>
    <bug_when>2021-06-30 22:54:43 +0000</bug_when>
    <thetext>https://autobuilder.yoctoproject.org/typhoon/#/builders/81/builds/2214/steps/12/logs/stdio

qemux86-64-ptest fedora33-ty-1</thetext>
  </long_desc><long_desc isprivate="0" >
    <commentid>91147</commentid>
    <comment_count>12</comment_count>
    <who name="Alexandre Belloni">alexandre.belloni</who>
    <bug_when>2021-08-11 14:58:07 +0000</bug_when>
    <thetext>https://autobuilder.yoctoproject.org/typhoon/#/builders/82/builds/2061/steps/12/logs/stdio

qemuarm64-ptest ubuntu2004-arm-1</thetext>
  </long_desc><long_desc isprivate="0" >
    <commentid>91421</commentid>
    <comment_count>13</comment_count>
    <who name="Alexandre Belloni">alexandre.belloni</who>
    <bug_when>2021-09-16 09:04:53 +0000</bug_when>
    <thetext>https://autobuilder.yoctoproject.org/typhoon/#/builders/82/builds/2147/steps/12/logs/stdio

qemuarm64-ptest ubuntu2004-arm-1</thetext>
  </long_desc><long_desc isprivate="0" >
    <commentid>91435</commentid>
    <comment_count>14</comment_count>
    <who name="Alexandre Belloni">alexandre.belloni</who>
    <bug_when>2021-09-16 10:34:08 +0000</bug_when>
    <thetext>https://autobuilder.yoctoproject.org/typhoon/#/builders/82/builds/2172/steps/12/logs/stdio

qemuarm64-ptest ubuntu2004-arm-1</thetext>
  </long_desc><long_desc isprivate="0" >
    <commentid>91506</commentid>
    <comment_count>15</comment_count>
    <who name="Alexandre Belloni">alexandre.belloni</who>
    <bug_when>2021-09-23 13:22:45 +0000</bug_when>
    <thetext>https://autobuilder.yoctoproject.org/typhoon/#/builders/81/builds/2555/steps/12/logs/stdio
qemux86-64-ptest debian10-ty-3</thetext>
  </long_desc><long_desc isprivate="0" >
    <commentid>92720</commentid>
    <comment_count>16</comment_count>
    <who name="Randy MacLeod">randy.macleod</who>
    <bug_when>2022-03-03 15:48:54 +0000</bug_when>
    <thetext>Not seen in months and strace tests are run frequently.</thetext>
  </long_desc><long_desc isprivate="0" >
    <commentid>94571</commentid>
    <comment_count>17</comment_count>
    <who name="Alexandre Belloni">alexandre.belloni</who>
    <bug_when>2022-12-22 14:34:16 +0000</bug_when>
    <thetext>https://autobuilder.yoctoproject.org/typhoon/#/builders/82/builds/4205/steps/12/logs/stdio

qemuarm64-ptest ubuntu2004-arm-1

&apos;strace&apos;: [&apos;trace_statfs.gen.test&apos;,
            &apos;qual_fault-syscall.test&apos;,
            &apos;trace_statfs.gen&apos;,
            &apos;qual_fault-syscall&apos;],</thetext>
  </long_desc><long_desc isprivate="0" >
    <commentid>94578</commentid>
    <comment_count>18</comment_count>
    <who name="Randy MacLeod">randy.macleod</who>
    <bug_when>2022-12-22 15:52:24 +0000</bug_when>
    <thetext>Need to update to strace-6.1 as well.</thetext>
  </long_desc><long_desc isprivate="0" >
    <commentid>94666</commentid>
    <comment_count>19</comment_count>
    <who name="Alexandre Belloni">alexandre.belloni</who>
    <bug_when>2023-01-11 21:57:45 +0000</bug_when>
    <thetext>https://autobuilder.yoctoproject.org/typhoon/#/builders/82/builds/4343/steps/12/logs/stdio
qemuarm64-ptest ubuntu2004-arm-1</thetext>
  </long_desc><long_desc isprivate="0" >
    <commentid>95217</commentid>
    <comment_count>20</comment_count>
    <who name="Alexandre Belloni">alexandre.belloni</who>
    <bug_when>2023-03-30 13:08:53 +0000</bug_when>
    <thetext>https://autobuilder.yoctoproject.org/typhoon/#/builders/82/builds/4653/steps/12/logs/stdio

qemuarm64-ptest ubuntu2004-arm-1</thetext>
  </long_desc><long_desc isprivate="0" >
    <commentid>97872</commentid>
    <comment_count>21</comment_count>
    <who name="João Marcos Costa">joaomarcos.costa</who>
    <bug_when>2024-01-17 15:43:39 +0000</bug_when>
    <thetext>https://autobuilder.yoctoproject.org/typhoon/#/builders/82/builds/5562/steps/13/logs/stdio

qemuarm64-ptest ubuntu1804-arm-1</thetext>
  </long_desc><long_desc isprivate="0" >
    <commentid>98249</commentid>
    <comment_count>22</comment_count>
    <who name="João Marcos Costa">joaomarcos.costa</who>
    <bug_when>2024-02-22 14:34:31 +0000</bug_when>
    <thetext>https://autobuilder.yoctoproject.org/typhoon/#/builders/82/builds/6087/steps/12/logs/stdio

Failed ptests:
{&apos;strace&apos;: [&apos;qual_fault-syscall.test&apos;,
            &apos;qual_fault.test&apos;,
            &apos;qual_fault-syscall&apos;,
            &apos;qual_fault&apos;]}

qemuarm64-ptest ubuntu2004-arm-1</thetext>
  </long_desc><long_desc isprivate="0" >
    <commentid>98686</commentid>
    <comment_count>23</comment_count>
    <who name="João Marcos Costa">joaomarcos.costa</who>
    <bug_when>2024-04-03 12:50:00 +0000</bug_when>
    <thetext>https://autobuilder.yoctoproject.org/typhoon/#/builders/82/builds/6261/steps/13/logs/stdio

Failed ptests:
{&apos;strace&apos;: [&apos;qual_fault-syscall.test&apos;,
            &apos;qual_fault.test&apos;,
            &apos;qual_fault-syscall&apos;,
            &apos;qual_fault&apos;]}

qemuarm64-ptest ubuntu1804-arm-1</thetext>
  </long_desc><long_desc isprivate="0" >
    <commentid>99217</commentid>
    <comment_count>24</comment_count>
    <who name="João Marcos Costa">joaomarcos.costa</who>
    <bug_when>2024-06-18 08:04:16 +0000</bug_when>
    <thetext>https://autobuilder.yoctoproject.org/typhoon/#/builders/82/builds/6544/steps/12/logs/stdio

AssertionError: 
Failed ptests:
{&apos;strace&apos;: [&apos;filtering_syscall-syntax.test&apos;,
            &apos;qual_fault-syscall.test&apos;,
            &apos;filtering_syscall-syntax&apos;,
            &apos;qual_fault-syscall&apos;]}

qemuarm64-ptest ubuntu2204-arm-1</thetext>
  </long_desc><long_desc isprivate="0" >
    <commentid>99251</commentid>
    <comment_count>25</comment_count>
    <who name="João Marcos Costa">joaomarcos.costa</who>
    <bug_when>2024-06-24 13:02:03 +0000</bug_when>
    <thetext>https://autobuilder.yoctoproject.org/typhoon/#/builders/82/builds/6567/steps/12/logs/stdio

qemuarm64-ptest ubuntu2004-arm-1</thetext>
  </long_desc><long_desc isprivate="0" >
    <commentid>99553</commentid>
    <comment_count>26</comment_count>
    <who name="João Marcos Costa">joaomarcos.costa</who>
    <bug_when>2024-08-19 12:06:02 +0000</bug_when>
    <thetext>https://autobuilder.yoctoproject.org/typhoon/#/builders/82/builds/6688/steps/12/logs/stdio

qemuarm64-ptest ubuntu2004-arm-1</thetext>
  </long_desc><long_desc isprivate="0" >
    <commentid>100722</commentid>
    <comment_count>27</comment_count>
    <who name="Randy MacLeod">randy.macleod</who>
    <bug_when>2025-01-23 15:52:48 +0000</bug_when>
    <thetext>Not seen recently or on the new AB cluster.</thetext>
  </long_desc>
      
      

    </bug>

</bugzilla>