<?xml version="1.0" encoding="UTF-8" standalone="yes" ?>
<!DOCTYPE bugzilla SYSTEM "https://bugzilla.yoctoproject.org/page.cgi?id=bugzilla.dtd">

<bugzilla version="5.0.6"
          urlbase="https://bugzilla.yoctoproject.org/"
          
          maintainer="it-coreprojects-helpdesk@linuxfoundation.org"
>

    <bug>
          <bug_id>14238</bug_id>
          
          <creation_ts>2021-02-18 19:34:01 +0000</creation_ts>
          <short_desc>nativesdk-glibc patch not applying</short_desc>
          <delta_ts>2021-02-19 12:50:09 +0000</delta_ts>
          <reporter_accessible>1</reporter_accessible>
          <cclist_accessible>1</cclist_accessible>
          <classification_id>7</classification_id>
          <classification>Build System, Metadata &amp; Runtime</classification>
          <product>OE-Core</product>
          <component>core</component>
          <version>3.2.3</version>
          <rep_platform>x86</rep_platform>
          <op_sys>Multiple</op_sys>
          <bug_status>RESOLVED</bug_status>
          <resolution>NOTABUG</resolution>
          
          
          <bug_file_loc></bug_file_loc>
          <status_whiteboard></status_whiteboard>
          <keywords></keywords>
          <priority>Undecided</priority>
          <bug_severity>normal</bug_severity>
          <target_milestone>---</target_milestone>
          
          
          <everconfirmed>1</everconfirmed>
          <reporter name="Jagadheesan">Jagadheesan_Duraisamy</reporter>
          <assigned_to name="Anuj Mittal">anuj.mittal</assigned_to>
          <cc>meta.mr.watcher</cc>
    
    <cc>meta.watcher</cc>
          
          
          <cf_os>---</cf_os>
          <cf_regression_type>---</cf_regression_type>
          
          <cf_docchange>Don&apos;t know</cf_docchange>

      

      

      

          <comment_sort_order>oldest_to_newest</comment_sort_order>  
          <long_desc isprivate="0" >
    <commentid>89298</commentid>
    <comment_count>0</comment_count>
    <who name="Jagadheesan">Jagadheesan_Duraisamy</who>
    <bug_when>2021-02-18 19:34:01 +0000</bug_when>
    <thetext>https://autobuilder.yoctoproject.org/typhoon/#/builders/20/builds/3395/steps/10/logs/step1b

ERROR: nativesdk-glibc-2.32-r0 do_patch: Command Error: &apos;quilt --quiltrc /home/pokybuild/yocto-worker/buildtools/build/build/tmp/work/x86_64-nativesdk-pokysdk-linux/nativesdk-glibc/2.32-r0/recipe-sysroot-native/etc/quiltrc push&apos; exited with 0  Output:
stdout: Applying patch faccessat2-perm.patch
patching file sysdeps/unix/sysv/linux/faccessat.c
Hunk #1 FAILED at 34.
1 out of 1 hunk FAILED -- rejects in file sysdeps/unix/sysv/linux/faccessat.c
Patch faccessat2-perm.patch does not apply (enforce with -f)


https://autobuilder.yoctoproject.org/typhoon/#/builders/20/builds/3395/steps/10/logs/step2b

ERROR: nativesdk-glibc-2.32-r0 do_patch: Command Error: &apos;quilt --quiltrc /home/pokybuild/yocto-worker/buildtools/build/build/tmp/work/i686-nativesdk-pokysdk-linux/nativesdk-glibc/2.32-r0/recipe-sysroot-native/etc/quiltrc push&apos; exited with 0  Output:
stdout: Applying patch faccessat2-perm.patch
patching file sysdeps/unix/sysv/linux/faccessat.c
Hunk #1 FAILED at 34.
1 out of 1 hunk FAILED -- rejects in file sysdeps/unix/sysv/linux/faccessat.c
Patch faccessat2-perm.patch does not apply (enforce with -f)


https://autobuilder.yoctoproject.org/typhoon/#/builders/20/builds/3395/steps/10/logs/step3b

ERROR: nativesdk-glibc-2.32-r0 do_patch: Command Error: &apos;quilt --quiltrc /home/pokybuild/yocto-worker/buildtools/build/build/tmp/work/aarch64-nativesdk-pokysdk-linux/nativesdk-glibc/2.32-r0/recipe-sysroot-native/etc/quiltrc push&apos; exited with 0  Output:
stdout: Applying patch faccessat2-perm.patch
patching file sysdeps/unix/sysv/linux/faccessat.c
Hunk #1 FAILED at 34.
1 out of 1 hunk FAILED -- rejects in file sysdeps/unix/sysv/linux/faccessat.c
Patch faccessat2-perm.patch does not apply (enforce with -f)</thetext>
  </long_desc><long_desc isprivate="0" >
    <commentid>89306</commentid>
    <comment_count>1</comment_count>
    <who name="Anuj Mittal">anuj.mittal</who>
    <bug_when>2021-02-19 07:26:18 +0000</bug_when>
    <thetext>Thank you for checking the build I had started. Sorry, I forgot to deselect SWAT flag while starting the build.

I was testing some WIP patches for gatesgarth and had resolved this problem in a later build. So, closing this.</thetext>
  </long_desc><long_desc isprivate="0" >
    <commentid>89320</commentid>
    <comment_count>2</comment_count>
    <who name="Jagadheesan">Jagadheesan_Duraisamy</who>
    <bug_when>2021-02-19 12:50:09 +0000</bug_when>
    <thetext>No problem. Thanks.</thetext>
  </long_desc>
      
      

    </bug>

</bugzilla>