<?xml version="1.0" encoding="UTF-8" standalone="yes" ?>
<!DOCTYPE bugzilla SYSTEM "https://bugzilla.yoctoproject.org/page.cgi?id=bugzilla.dtd">

<bugzilla version="5.0.6"
          urlbase="https://bugzilla.yoctoproject.org/"
          
          maintainer="it-coreprojects-helpdesk@linuxfoundation.org"
>

    <bug>
          <bug_id>14246</bug_id>
          
          <creation_ts>2021-02-19 18:28:21 +0000</creation_ts>
          <short_desc>devtool test failures: github tls timeout</short_desc>
          <delta_ts>2021-06-28 10:25:45 +0000</delta_ts>
          <reporter_accessible>1</reporter_accessible>
          <cclist_accessible>1</cclist_accessible>
          <classification_id>10</classification_id>
          <classification>QA/Testing</classification>
          <product>Functional (self) Testing</product>
          <component>oe-selftest</component>
          <version>unspecified</version>
          <rep_platform>x86</rep_platform>
          <op_sys>Multiple</op_sys>
          <bug_status>RESOLVED</bug_status>
          <resolution>WORKSFORME</resolution>
          
          
          <bug_file_loc></bug_file_loc>
          <status_whiteboard>AB-INT</status_whiteboard>
          <keywords></keywords>
          <priority>Medium</priority>
          <bug_severity>normal</bug_severity>
          <target_milestone>3.4</target_milestone>
          
          
          <everconfirmed>1</everconfirmed>
          <reporter name="Jagadheesan">Jagadheesan_Duraisamy</reporter>
          <assigned_to name="Unassigned">unassigned</assigned_to>
          <cc>alexandre.belloni</cc>
    
    <cc>naveen.kumar.saini</cc>
    
    <cc>randy.macleod</cc>
    
    <cc>richard.purdie</cc>
          
          
          <cf_os>---</cf_os>
          <cf_regression_type>---</cf_regression_type>
          
          <cf_docchange>Don&apos;t know</cf_docchange>

      

      

      

          <comment_sort_order>oldest_to_newest</comment_sort_order>  
          <long_desc isprivate="0" >
    <commentid>89325</commentid>
    <comment_count>0</comment_count>
    <who name="Jagadheesan">Jagadheesan_Duraisamy</who>
    <bug_when>2021-02-19 18:28:21 +0000</bug_when>
    <thetext>From:
https://autobuilder.yoctoproject.org/typhoon/#/builders/87/builds/1853/steps/14/logs/stdio

Error 1:

2021-02-16 21:32:12,397 - oe-selftest - INFO - 12: 5/25 180/424 (630.82s) (devtool.DevtoolAddTests.test_devtool_add_git_local)
2021-02-16 21:32:12,397 - oe-selftest - INFO - testtools.testresult.real._StringException: Traceback (most recent call last):
  File &quot;/home/pokybuild/yocto-worker/oe-selftest-ubuntu/build/meta/lib/oeqa/selftest/cases/devtool.py&quot;, line 327, in test_devtool_add_git_local
    result = runCmd(&apos;devtool add %s&apos; % srcdir)
  File &quot;/home/pokybuild/yocto-worker/oe-selftest-ubuntu/build/meta/lib/oeqa/utils/commands.py&quot;, line 210, in runCmd
    raise AssertionError(&quot;Command &apos;%s&apos; returned non-zero exit status %d:\n%s&quot; % (command, result.status, exc_output))
AssertionError: Command &apos;devtool add /tmp/devtoolqad9sp8lxe/noname&apos; returned non-zero exit status 1:

Error 2:

2021-02-17 05:08:07,411 - oe-selftest - INFO - FAIL: devtool.DevtoolAddTests.test_devtool_add_library (subunit.RemotedTestCase)
2021-02-17 05:08:07,411 - oe-selftest - INFO - ----------------------------------------------------------------------
2021-02-17 05:08:07,411 - oe-selftest - INFO - testtools.testresult.real._StringException: Traceback (most recent call last):
  File &quot;/home/pokybuild/yocto-worker/oe-selftest-ubuntu/build/meta/lib/oeqa/selftest/cases/devtool.py&quot;, line 382, in test_devtool_add_library
    bb_vars = get_bb_vars([&apos;TESTLIBOUTPUT&apos;, &apos;STAMP&apos;], &apos;libftdi&apos;)
  File &quot;/home/pokybuild/yocto-worker/oe-selftest-ubuntu/build/meta/lib/oeqa/utils/commands.py&quot;, line 246, in get_bb_vars
    bbenv = get_bb_env(target, postconfig=postconfig)
  File &quot;/home/pokybuild/yocto-worker/oe-selftest-ubuntu/build/meta/lib/oeqa/utils/commands.py&quot;, line 240, in get_bb_env
    return bitbake(&quot;-e %s&quot; % target, postconfig=postconfig).output
  File &quot;/home/pokybuild/yocto-worker/oe-selftest-ubuntu/build/meta/lib/oeqa/utils/commands.py&quot;, line 232, in bitbake
    return runCmd(cmd, ignore_status, timeout, output_log=output_log, **options)
  File &quot;/home/pokybuild/yocto-worker/oe-selftest-ubuntu/build/meta/lib/oeqa/utils/commands.py&quot;, line 210, in runCmd
    raise AssertionError(&quot;Command &apos;%s&apos; returned non-zero exit status %d:\n%s&quot; % (command, result.status, exc_output))


Error 3:

2021-02-16 23:05:28,960 - oe-selftest - INFO - recipetool.RecipetoolTests.test_recipetool_create_github (subunit.RemotedTestCase)
2021-02-16 23:05:28,961 - oe-selftest - INFO -  ... FAIL
2021-02-16 23:05:28,961 - oe-selftest - INFO - 14: 36/43 297/424 (184.68s) (recipetool.RecipetoolTests.test_recipetool_create_github)
2021-02-16 23:05:28,961 - oe-selftest - INFO - testtools.testresult.real._StringException: Traceback (most recent call last):
  File &quot;/home/pokybuild/yocto-worker/oe-selftest-ubuntu/build/meta/lib/oeqa/selftest/cases/recipetool.py&quot;, line 446, in test_recipetool_create_github
    result = runCmd([&apos;recipetool&apos;, &apos;create&apos;, &apos;-o&apos;, temprecipe, srcuri])
  File &quot;/home/pokybuild/yocto-worker/oe-selftest-ubuntu/build/meta/lib/oeqa/utils/commands.py&quot;, line 210, in runCmd
    raise AssertionError(&quot;Command &apos;%s&apos; returned non-zero exit status %d:\n%s&quot; % (command, result.status, exc_output))
AssertionError: Command &apos;[&apos;recipetool&apos;, &apos;create&apos;, &apos;-o&apos;, &apos;/tmp/recipetoolqahmrqmu54/recipe&apos;, &apos;https://github.com/mesonbuild/meson;rev=0.32.0&apos;]&apos; returned non-zero exit status 1:</thetext>
  </long_desc><long_desc isprivate="0" >
    <commentid>89395</commentid>
    <comment_count>1</comment_count>
    <who name="Randy MacLeod">randy.macleod</who>
    <bug_when>2021-02-25 15:49:03 +0000</bug_when>
    <thetext>Two of the issues listed are duplicates of: 14201
So just the github TLS timeout remains.</thetext>
  </long_desc><long_desc isprivate="0" >
    <commentid>90158</commentid>
    <comment_count>2</comment_count>
    <who name="Randy MacLeod">randy.macleod</who>
    <bug_when>2021-04-29 14:53:10 +0000</bug_when>
    <thetext>*** Bug 14361 has been marked as a duplicate of this bug. ***</thetext>
  </long_desc><long_desc isprivate="0" >
    <commentid>90779</commentid>
    <comment_count>3</comment_count>
    <who name="Richard Purdie">richard.purdie</who>
    <bug_when>2021-06-28 10:25:45 +0000</bug_when>
    <thetext>This hasn&apos;t recurred on the autobuilder so closing.</thetext>
  </long_desc>
      
      

    </bug>

</bugzilla>