<?xml version="1.0" encoding="UTF-8" standalone="yes" ?>
<!DOCTYPE bugzilla SYSTEM "https://bugzilla.yoctoproject.org/page.cgi?id=bugzilla.dtd">

<bugzilla version="5.0.6"
          urlbase="https://bugzilla.yoctoproject.org/"
          
          maintainer="it-coreprojects-helpdesk@linuxfoundation.org"
>

    <bug>
          <bug_id>14279</bug_id>
          
          <creation_ts>2021-03-04 23:06:11 +0000</creation_ts>
          <short_desc>qemux86 failed to shutdown</short_desc>
          <delta_ts>2021-03-11 19:40:57 +0000</delta_ts>
          <reporter_accessible>1</reporter_accessible>
          <cclist_accessible>1</cclist_accessible>
          <classification_id>7</classification_id>
          <classification>Build System, Metadata &amp; Runtime</classification>
          <product>OE-Core</product>
          <component>core</component>
          <version>unspecified</version>
          <rep_platform>x86</rep_platform>
          <op_sys>Multiple</op_sys>
          <bug_status>RESOLVED</bug_status>
          <resolution>DUPLICATE</resolution>
          <dup_id>14128</dup_id>
          
          <bug_file_loc></bug_file_loc>
          <status_whiteboard>AB-INT</status_whiteboard>
          <keywords></keywords>
          <priority>Medium+</priority>
          <bug_severity>normal</bug_severity>
          <target_milestone>3.3 M4</target_milestone>
          
          
          <everconfirmed>1</everconfirmed>
          <reporter name="Aníbal Limón">anibal</reporter>
          <assigned_to name="Unassigned">unassigned</assigned_to>
          <cc>alexandre.belloni</cc>
    
    <cc>meta.mr.watcher</cc>
    
    <cc>meta.watcher</cc>
    
    <cc>randy.macleod</cc>
          
          
          <cf_os>---</cf_os>
          <cf_regression_type>---</cf_regression_type>
          
          <cf_docchange>No (bug/feature does not impact docs)</cf_docchange>

      

      

      

          <comment_sort_order>oldest_to_newest</comment_sort_order>  
          <long_desc isprivate="0" >
    <commentid>89507</commentid>
    <comment_count>0</comment_count>
    <who name="Aníbal Limón">anibal</who>
    <bug_when>2021-03-04 23:06:11 +0000</bug_when>
    <thetext>Log,

...
2021-03-04 04:10:21,781 - oe-selftest - INFO - 0: 3/3 3/4 (0.10s) (meta_ide.MetaIDE.test_meta_ide_had_installed_meta_ide_support)
2021-03-04 04:14:43,498 - oe-selftest - INFO - runqemu.QemuTest.test_qemu_can_shutdown (subunit.RemotedTestCase)
2021-03-04 04:14:43,498 - oe-selftest - INFO -  ... FAIL
2021-03-04 04:14:43,499 - oe-selftest - INFO - 1: 1/1 4/4 (391.46s) (runqemu.QemuTest.test_qemu_can_shutdown)
2021-03-04 04:14:43,499 - oe-selftest - INFO - testtools.testresult.real._StringException: Traceback (most recent call last):
  File &quot;/home/pokybuild/yocto-worker/qemux86/build/meta/lib/oeqa/selftest/cases/runqemu.py&quot;, line 191, in test_qemu_can_shutdown
    self.assertTrue(qemu_shutdown_succeeded, &apos;Failed: %s does not shutdown within timeout(%s)&apos; % (self.machine, shutdown_timeout))
  File &quot;/usr/lib/python3.6/unittest/case.py&quot;, line 682, in assertTrue
    raise self.failureException(msg)
AssertionError: False is not true : Failed: qemux86 does not shutdown within timeout(120)
...

From,

https://autobuilder.yoctoproject.org/typhoon/#/builders/59/builds/3151/steps/19/logs/stdio</thetext>
  </long_desc><long_desc isprivate="0" >
    <commentid>89606</commentid>
    <comment_count>1</comment_count>
    <who name="Alexandre Belloni">alexandre.belloni</who>
    <bug_when>2021-03-11 19:40:57 +0000</bug_when>
    <thetext>Merge of all the qemu does not shutdown within timeout issues

*** This bug has been marked as a duplicate of bug 14128 ***</thetext>
  </long_desc>
      
      

    </bug>

</bugzilla>