<?xml version="1.0" encoding="UTF-8" standalone="yes" ?>
<!DOCTYPE bugzilla SYSTEM "https://bugzilla.yoctoproject.org/page.cgi?id=bugzilla.dtd">

<bugzilla version="5.0.6"
          urlbase="https://bugzilla.yoctoproject.org/"
          
          maintainer="it-coreprojects-helpdesk@linuxfoundation.org"
>

    <bug>
          <bug_id>14326</bug_id>
          
          <creation_ts>2021-03-25 09:36:32 +0000</creation_ts>
          <short_desc>do_testimage error test_galculator failure</short_desc>
          <delta_ts>2021-03-25 15:16:30 +0000</delta_ts>
          <reporter_accessible>1</reporter_accessible>
          <cclist_accessible>1</cclist_accessible>
          <classification_id>10</classification_id>
          <classification>QA/Testing</classification>
          <product>Runtime Testing</product>
          <component>testimage</component>
          <version>3.3</version>
          <rep_platform>x86</rep_platform>
          <op_sys>Multiple</op_sys>
          <bug_status>RESOLVED</bug_status>
          <resolution>FIXED</resolution>
          
          
          <bug_file_loc></bug_file_loc>
          <status_whiteboard></status_whiteboard>
          <keywords></keywords>
          <priority>Undecided</priority>
          <bug_severity>normal</bug_severity>
          <target_milestone>---</target_milestone>
          
          
          <everconfirmed>1</everconfirmed>
          <reporter name="Oleksiy Obitotskyy">oobitots</reporter>
          <assigned_to name="Unassigned">unassigned</assigned_to>
          <cc>randy.macleod</cc>
          
          
          <cf_os>---</cf_os>
          <cf_regression_type>---</cf_regression_type>
          
          <cf_docchange>Don&apos;t know</cf_docchange>

      

      

      

          <comment_sort_order>oldest_to_newest</comment_sort_order>  
          <long_desc isprivate="0" >
    <commentid>89735</commentid>
    <comment_count>0</comment_count>
    <who name="Oleksiy Obitotskyy">oobitots</who>
    <bug_when>2021-03-25 09:36:32 +0000</bug_when>
    <thetext>https://autobuilder.yoctoproject.org/typhoon/#/builders/50/builds/3232


SDK testing environment: core2-32-poky-linux
Traceback (most recent call last):
  File &quot;/home/pokybuild/yocto-worker/pkgman-deb-non-deb/build/meta/lib/oeqa/sdk/cases/buildgalculator.py&quot;, line 38, in test_galculator
    self._run(&quot;cd {source} &amp;&amp; sed -i -e &apos;/s_preferences.*prefs;/d&apos; src/main.c &amp;&amp; autoreconf -i -f -I $OECORE_TARGET_SYSROOT/usr/share/aclocal -I m4&quot;.format(**dirs))
  File &quot;/home/pokybuild/yocto-worker/pkgman-deb-non-deb/build/meta/lib/oeqa/sdk/case.py&quot;, line 14, in _run
    return subprocess.check_output(&quot;. %s &gt; /dev/null; %s;&quot; % \
  File &quot;/usr/lib64/python3.8/subprocess.py&quot;, line 415, in check_output
    return run(*popenargs, stdout=PIPE, timeout=timeout, check=True,
  File &quot;/usr/lib64/python3.8/subprocess.py&quot;, line 516, in run
    raise CalledProcessError(retcode, process.args,
oeqa.utils.subprocesstweak.OETestCalledProcessError: Command &apos;. /home/pokybuild/yocto-worker/pkgman-deb-non-deb/build/build/tmp/work/qemux86-poky-linux/core-image-sato/1.0-r0/testimage-sdk/environment-setup-core2-32-poky-linux &gt; /dev/null; cd /home/pokybuild/yocto-worker/pkgman-deb-non-deb/build/build/tmp/work/qemux86-poky-linux/core-image-sato/1.0-r0/testimage-sdk/galculatorfgm35zvo/galculator-2.1.4 &amp;&amp; sed -i -e &apos;/s_preferences.*prefs;/d&apos; src/main.c &amp;&amp; autoreconf -i -f -I $OECORE_TARGET_SYSROOT/usr/share/aclocal -I m4;&apos; returned non-zero exit status 1
Standard Output: autoreconf: warning: autoconf input should be named &apos;configure.ac&apos;, not &apos;configure.in&apos;
aclocal: warning: autoconf input should be named &apos;configure.ac&apos;, not &apos;configure.in&apos;
aclocal: warning: couldn&apos;t open directory &apos;/home/pokybuild/yocto-worker/pkgman-deb-non-deb/build/build/tmp/work/qemux86-poky-linux/core-image-sato/1.0-r0/testimage-sdk/sysroots/core2-32-poky-linux/usr/share/aclocal&apos;: No such file or directory
configure.in:76: warning: macro &apos;AM_GLIB_GNU_GETTEXT&apos; not found in library
...
configure.in:83: the top level
configure.in:102: warning: AC_OUTPUT should be used without arguments.
configure.in:102: You should run autoupdate.
configure.in:76: error: possibly undefined macro: AM_GLIB_GNU_GETTEXT
      If this token and others are legitimate, please use m4_pattern_allow.
      See the Autoconf documentation.
autoreconf: error: /home/pokybuild/yocto-worker/pkgman-deb-non-deb/build/build/tmp/work/qemux86-poky-linux/core-image-sato/1.0-r0/testimage-sdk/sysroots/i686-pokysdk-linux/usr/bin/autoconf failed with exit status: 1
...
No python package in the SDK
RESULTS:
RESULTS - assimp.BuildAssimp.test_assimp: PASSED (112.24s)
RESULTS - buildcpio.BuildCpioTest.test_cpio: PASSED (28.16s)
RESULTS - buildepoxy.EpoxyTest.test_epoxy: PASSED (18.48s)
RESULTS - buildlzip.BuildLzipTest.test_lzip: PASSED (3.01s)
RESULTS - gcc.GccCompileTest.test_gcc_compile: PASSED (0.09s)
RESULTS - gcc.GccCompileTest.test_gpp2_compile: PASSED (0.13s)
RESULTS - gcc.GccCompileTest.test_gpp_compile: PASSED (0.20s)
RESULTS - gcc.GccCompileTest.test_make: PASSED (0.10s)
RESULTS - perl.PerlTest.test_perl: PASSED (0.02s)
RESULTS - python.Python3Test.test_python3: PASSED (0.04s)
RESULTS - python.Python2Test.test_python2: SKIPPED (0.00s)
RESULTS - buildgalculator.GalculatorTest.test_galculator: ERROR (6.01s)
SUMMARY:
core-image-sato sdk (poky-glibc-i686-core-image-sato-core2-32-qemux86-toolchain-3.2+snapshot.sh:environment-setup-core2-32-poky-linux) - Ran 12 tests in 168.928s
core-image-sato sdk - FAIL - Required tests failed (successes=10, skipped=1, failures=0, errors=1)
ERROR: core-image-sato-1.0-r0 do_testsdk: core-image-sato - FAILED - check the task log and the commands log
ERROR: Logfile of failure stored in: /home/pokybuild/yocto-worker/pkgman-deb-non-deb/build/build/tmp/work/qemux86-poky-linux/core-image-sato/1.0-r0/temp/log.do_testsdk.31909
NOTE: recipe core-image-sato-1.0-r0: task do_testsdk: Failed
ERROR: Task (/home/pokybuild/yocto-worker/pkgman-deb-non-deb/build/meta/recipes-sato/images/core-image-sato.bb:do_testsdk) failed with exit code &apos;1&apos;</thetext>
  </long_desc><long_desc isprivate="0" >
    <commentid>89736</commentid>
    <comment_count>1</comment_count>
    <who name="Oleksiy Obitotskyy">oobitots</who>
    <bug_when>2021-03-25 09:43:06 +0000</bug_when>
    <thetext>Build has two issues - this one is described:

https://autobuilder.yoctoproject.org/typhoon/#/builders/50/builds/3232/steps/12/logs/stdio</thetext>
  </long_desc><long_desc isprivate="0" >
    <commentid>89737</commentid>
    <comment_count>2</comment_count>
    <who name="Oleksiy Obitotskyy">oobitots</who>
    <bug_when>2021-03-25 09:47:13 +0000</bug_when>
    <thetext>https://autobuilder.yoctoproject.org/typhoon/#/builders/47/builds/3250/steps/15/logs/stdio

SDK testing environment: armv7vet2hf-neon-oe-linux-gnueabi
Traceback (most recent call last):
  File &quot;/home/pokybuild/yocto-worker/qemuarm-oecore/build/meta/lib/oeqa/sdk/cases/buildgalculator.py&quot;, line 39, in test_galculator
    self._run(&quot;cd {build} &amp;&amp; {source}/configure $CONFIGURE_FLAGS&quot;.format(**dirs))
  File &quot;/home/pokybuild/yocto-worker/qemuarm-oecore/build/meta/lib/oeqa/sdk/case.py&quot;, line 16, in _run
    stderr=subprocess.STDOUT, universal_newlines=True)
  File &quot;/usr/lib/python3.7/subprocess.py&quot;, line 395, in check_output
    **kwargs).stdout
  File &quot;/usr/lib/python3.7/subprocess.py&quot;, line 487, in run
    output=stdout, stderr=stderr)
oeqa.utils.subprocesstweak.OETestCalledProcessError: Command &apos;. /home/pokybuild/yocto-worker/qemuarm-oecore/build/build/tmp-glibc/work/qemuarm-oe-linux-gnueabi/core-image-sato/1.0-r0/testimage-sdk/environment-setup-armv7vet2hf-neon-oe-linux-gnueabi &gt; /dev/null; cd /home/pokybuild/yocto-worker/qemuarm-oecore/build/build/tmp-glibc/work/qemuarm-oe-linux-gnueabi/core-image-sato/1.0-r0/testimage-sdk/galculator9ruo4l5g/build &amp;&amp; /home/pokybuild/yocto-worker/qemuarm-oecore/build/build/tmp-glibc/work/qemuarm-oe-linux-gnueabi/core-image-sato/1.0-r0/testimage-sdk/galculator9ruo4l5g/galculator-2.1.4/configure $CONFIGURE_FLAGS;&apos; returned non-zero exit status 1</thetext>
  </long_desc><long_desc isprivate="0" >
    <commentid>89761</commentid>
    <comment_count>3</comment_count>
    <who name="Randy MacLeod">randy.macleod</who>
    <bug_when>2021-03-25 15:15:58 +0000</bug_when>
    <thetext>Happened on master-next.
It had problems with util-linux according to Richard.
It shouldn&apos;t have been able to build the SDK in the first place.
The patch that caused the problem has been drop from master-next and was never in master.</thetext>
  </long_desc><long_desc isprivate="0" >
    <commentid>89764</commentid>
    <comment_count>4</comment_count>
    <who name="Randy MacLeod">randy.macleod</who>
    <bug_when>2021-03-25 15:16:30 +0000</bug_when>
    <thetext>*** Bug 14327 has been marked as a duplicate of this bug. ***</thetext>
  </long_desc>
      
      

    </bug>

</bugzilla>