<?xml version="1.0" encoding="UTF-8" standalone="yes" ?>
<!DOCTYPE bugzilla SYSTEM "https://bugzilla.yoctoproject.org/page.cgi?id=bugzilla.dtd">

<bugzilla version="5.0.6"
          urlbase="https://bugzilla.yoctoproject.org/"
          
          maintainer="it-coreprojects-helpdesk@linuxfoundation.org"
>

    <bug>
          <bug_id>14566</bug_id>
          
          <creation_ts>2021-09-24 14:25:40 +0000</creation_ts>
          <short_desc>SSH connection failures</short_desc>
          <delta_ts>2022-04-16 10:14:18 +0000</delta_ts>
          <reporter_accessible>1</reporter_accessible>
          <cclist_accessible>1</cclist_accessible>
          <classification_id>10</classification_id>
          <classification>QA/Testing</classification>
          <product>Runtime Testing</product>
          <component>oeqa/sdk</component>
          <version>unspecified</version>
          <rep_platform>x86</rep_platform>
          <op_sys>Multiple</op_sys>
          <bug_status>RESOLVED</bug_status>
          <resolution>OBSOLETE</resolution>
          
          
          <bug_file_loc></bug_file_loc>
          <status_whiteboard>AB-INT AB-INT-NET</status_whiteboard>
          <keywords></keywords>
          <priority>Medium</priority>
          <bug_severity>normal</bug_severity>
          <target_milestone>4.1</target_milestone>
          
          
          <everconfirmed>1</everconfirmed>
          <reporter name="Oleksiy Obitotskyy">oobitots</reporter>
          <assigned_to name="Unassigned">unassigned</assigned_to>
          <cc>alexandre.belloni</cc>
    
    <cc>randy.macleod</cc>
    
    <cc>richard.purdie</cc>
          
          
          <cf_os>---</cf_os>
          <cf_regression_type>---</cf_regression_type>
          
          <cf_docchange>Don&apos;t know</cf_docchange>

      

      

      

          <comment_sort_order>oldest_to_newest</comment_sort_order>  
          <long_desc isprivate="0" >
    <commentid>91554</commentid>
    <comment_count>0</comment_count>
    <who name="Oleksiy Obitotskyy">oobitots</who>
    <bug_when>2021-09-24 14:25:40 +0000</bug_when>
    <thetext>https://autobuilder.yoctoproject.org/typhoon/#/builders/42/builds/4037
https://autobuilder.yoctoproject.org/typhoon/#/builders/53/builds/4012

Traceback (most recent call last):
  File &quot;/home/pokybuild/yocto-worker/qemuarm/build/meta/lib/oeqa/core/decorator/__init__.py&quot;, line 36, in wrapped_f
    return func(*args, **kwargs)
  File &quot;/home/pokybuild/yocto-worker/qemuarm/build/meta/lib/oeqa/core/decorator/__init__.py&quot;, line 36, in wrapped_f
    return func(*args, **kwargs)
  File &quot;/home/pokybuild/yocto-worker/qemuarm/build/meta/lib/oeqa/runtime/cases/ssh.py&quot;, line 15, in test_ssh
    self.assertEqual(status, 0, msg=&apos;SSH Test failed: %s&apos; % output)
AssertionError: 255 != 0 : SSH Test failed: ssh: connect to host 192.168.7.4 port 22: No route to host</thetext>
  </long_desc><long_desc isprivate="0" >
    <commentid>92291</commentid>
    <comment_count>1</comment_count>
    <who name="Alexandre Belloni">alexandre.belloni</who>
    <bug_when>2022-01-13 00:54:59 +0000</bug_when>
    <thetext>https://autobuilder.yoctoproject.org/typhoon/#/builders/110/builds/3458/steps/13/logs/stdio

AssertionError: 255 != 0 : SYSTEMD_BUS_TIMEOUT=240s systemctl --version 
ssh: connect to host 192.168.7.6 port 22: No route to host

AssertionError: 255 != 0 : Xorg does not appear to be running ssh: connect to host 192.168.7.6 port 22: No route to host

qemuarm-alt fedora35-ty-1


fedora35-ty-1 has an SSD</thetext>
  </long_desc><long_desc isprivate="0" >
    <commentid>92292</commentid>
    <comment_count>2</comment_count>
    <who name="Alexandre Belloni">alexandre.belloni</who>
    <bug_when>2022-01-13 00:58:50 +0000</bug_when>
    <thetext>https://autobuilder.yoctoproject.org/typhoon/#/builders/110/builds/3460/steps/14/logs/stdio
qemuarm-alt debian9-ty-2</thetext>
  </long_desc><long_desc isprivate="0" >
    <commentid>92293</commentid>
    <comment_count>3</comment_count>
    <who name="Alexandre Belloni">alexandre.belloni</who>
    <bug_when>2022-01-13 00:59:37 +0000</bug_when>
    <thetext>https://autobuilder.yoctoproject.org/typhoon/#/builders/102/builds/2481/steps/14/logs/stdio
qemumips-alt debian9-ty-2

AssertionError: -15 != 0 : SSH Test failed: 
Process killed - no output for 300 seconds. Total running time: 305 seconds.</thetext>
  </long_desc><long_desc isprivate="0" >
    <commentid>92294</commentid>
    <comment_count>4</comment_count>
    <who name="Alexandre Belloni">alexandre.belloni</who>
    <bug_when>2022-01-13 01:02:42 +0000</bug_when>
    <thetext>https://autobuilder.yoctoproject.org/typhoon/#/builders/63/builds/4417/steps/13/logs/stdio
qemuppc ubuntu1804-ty-3</thetext>
  </long_desc><long_desc isprivate="0" >
    <commentid>92295</commentid>
    <comment_count>5</comment_count>
    <who name="Alexandre Belloni">alexandre.belloni</who>
    <bug_when>2022-01-13 08:40:58 +0000</bug_when>
    <thetext>The two previous occurrences on qemuarm-alt are actually bug 14673</thetext>
  </long_desc><long_desc isprivate="0" >
    <commentid>92562</commentid>
    <comment_count>6</comment_count>
    <who name="Alexandre Belloni">alexandre.belloni</who>
    <bug_when>2022-02-16 21:39:51 +0000</bug_when>
    <thetext>https://autobuilder.yoctoproject.org/typhoon/#/builders/96/builds/2757/steps/12/logs/stdio
ubuntu2004-arm-1 non-SSD</thetext>
  </long_desc><long_desc isprivate="0" >
    <commentid>92594</commentid>
    <comment_count>7</comment_count>
    <who name="Oleksiy Obitotskyy">oobitots</who>
    <bug_when>2022-02-18 13:00:57 +0000</bug_when>
    <thetext>https://autobuilder.yoctoproject.org/typhoon/#/builders/95/builds/2905/steps/12/logs/stdio

qemux86-64-ltp fedora35-ty-2</thetext>
  </long_desc><long_desc isprivate="0" >
    <commentid>92889</commentid>
    <comment_count>8</comment_count>
    <who name="Alexandre Belloni">alexandre.belloni</who>
    <bug_when>2022-03-31 12:28:49 +0000</bug_when>
    <thetext>https://autobuilder.yoctoproject.org/typhoon/#/builders/110/builds/3850/steps/12/logs/stdio

qemuarm-alt debian11-ty-1 no SSD</thetext>
  </long_desc><long_desc isprivate="0" >
    <commentid>92977</commentid>
    <comment_count>9</comment_count>
    <who name="Alexandre Belloni">alexandre.belloni</who>
    <bug_when>2022-04-11 13:01:42 +0000</bug_when>
    <thetext>https://autobuilder.yoctoproject.org/typhoon/#/builders/131/builds/416/steps/13/logs/stdio

qemuarm64-alt centos8-ty-1

We believe this one is du to a misconfiguration of connmand when using systemd and this is fixed in master-next</thetext>
  </long_desc><long_desc isprivate="0" >
    <commentid>92978</commentid>
    <comment_count>10</comment_count>
    <who name="Randy MacLeod">randy.macleod</who>
    <bug_when>2022-04-11 14:53:48 +0000</bug_when>
    <thetext>Alex. Did the commit make it to master? I assume we&apos;ll wait a month or two to see if it happens again so I&apos;ve moved it to 3.6/4.1.</thetext>
  </long_desc><long_desc isprivate="0" >
    <commentid>93052</commentid>
    <comment_count>11</comment_count>
    <who name="Alexandre Belloni">alexandre.belloni</who>
    <bug_when>2022-04-14 13:22:35 +0000</bug_when>
    <thetext>https://autobuilder.yoctoproject.org/typhoon/#/builders/131/builds/416/steps/13/logs/stdio

qemuarm64-alt centos8-ty-1 no SSD</thetext>
  </long_desc><long_desc isprivate="0" >
    <commentid>93056</commentid>
    <comment_count>12</comment_count>
    <who name="Alexandre Belloni">alexandre.belloni</who>
    <bug_when>2022-04-14 13:50:59 +0000</bug_when>
    <thetext>https://autobuilder.yoctoproject.org/typhoon/#/builders/95/builds/3136/steps/12/logs/stdio

qemux86-64-ltp stream8-ty-1

https://autobuilder.yocto.io/pub/failed-builds-data/stream8-ltp-20220410/


WARNING: core-image-sato-1.0-r0 do_testimage: Copy returned non-zero exit status 1:
ssh: connect to host 192.168.7.6 port 22: No route to host
WARNING: core-image-sato-1.0-r0 do_testimage: File could not be copied. Output: ssh: connect to host 192.168.7.6 port 22: No route to host
Traceback (most recent call last):
  File &quot;/home/pokybuild/yocto-worker/qemux86-64-ltp/build/meta/lib/oeqa/core/decorator/__init__.py&quot;, line 35, in wrapped_f
    return func(*args, **kwargs)
  File &quot;/home/pokybuild/yocto-worker/qemux86-64-ltp/build/meta/lib/oeqa/runtime/cases/ltp.py&quot;, line 115, in test_ltp_groups
    self.runltp(ltp_group)
  File &quot;/home/pokybuild/yocto-worker/qemux86-64-ltp/build/meta/lib/oeqa/runtime/cases/ltp.py&quot;, line 87, in runltp
    results, sections  = parser.parse(dst)
  File &quot;/home/pokybuild/yocto-worker/qemux86-64-ltp/build/meta/lib/oeqa/utils/logparser.py&quot;, line 116, in parse
    with open(logfile, errors=&apos;replace&apos;) as f:
FileNotFoundError: [Errno 2] No such file or directory: &apos;/home/pokybuild/yocto-worker/qemux86-64-ltp/build/build/tmp/work/qemux86_64-poky-linux/core-image-sato/1.0-r0/testimage/ltp_log.20220409205903/controllers&apos;
Stdout:
Tried to dump info from target but serial console failed
Failed CMD: find /var/log/ -type f 2&gt;/dev/null -exec echo &quot;====================&quot; \; -exec echo {} \; -exec echo &quot;====================&quot; \; -exec cat {} \; -exec echo &quot;&quot; \;</thetext>
  </long_desc><long_desc isprivate="0" >
    <commentid>93103</commentid>
    <comment_count>13</comment_count>
    <who name="Richard Purdie">richard.purdie</who>
    <bug_when>2022-04-16 10:14:18 +0000</bug_when>
    <thetext>This is another confused bug. I think the -alt testimage failres are from the connmand issue on systemd images. The ltp failures are different, those are where the kernel crashes part way through testing. I opened a new bug for the ltp issue and am closing this one. We need to try and keep similar issues together.</thetext>
  </long_desc>
      
      

    </bug>

</bugzilla>