<?xml version="1.0" encoding="UTF-8" standalone="yes" ?>
<!DOCTYPE bugzilla SYSTEM "https://bugzilla.yoctoproject.org/page.cgi?id=bugzilla.dtd">

<bugzilla version="5.0.6"
          urlbase="https://bugzilla.yoctoproject.org/"
          
          maintainer="it-coreprojects-helpdesk@linuxfoundation.org"
>

    <bug>
          <bug_id>1460</bug_id>
          
          <creation_ts>2011-09-06 08:58:49 +0000</creation_ts>
          <short_desc>[sstate]: numerous lib*-perl recipes fail due to sstate relocation issues</short_desc>
          <delta_ts>2011-09-07 17:43:29 +0000</delta_ts>
          <reporter_accessible>1</reporter_accessible>
          <cclist_accessible>1</cclist_accessible>
          <classification_id>7</classification_id>
          <classification>Build System, Metadata &amp; Runtime</classification>
          <product>OE-Core</product>
          <component>devtools / tool chain</component>
          <version>1.0</version>
          <rep_platform>x86</rep_platform>
          <op_sys>Multiple</op_sys>
          <bug_status>RESOLVED</bug_status>
          <resolution>FIXED</resolution>
          
          
          <bug_file_loc></bug_file_loc>
          <status_whiteboard></status_whiteboard>
          <keywords></keywords>
          <priority>High</priority>
          <bug_severity>major</bug_severity>
          <target_milestone>1.1</target_milestone>
          
          
          <everconfirmed>1</everconfirmed>
          <reporter name="Saul Wold">sgw</reporter>
          <assigned_to name="Saul Wold">sgw</assigned_to>
          <cc>meta.mr.watcher</cc>
    
    <cc>meta.watcher</cc>
    
    <cc>richard.purdie</cc>
          
          
          <cf_os>---</cf_os>
          <cf_regression_type>---</cf_regression_type>
          
          <cf_docchange>---</cf_docchange>

      

      

      

          <comment_sort_order>oldest_to_newest</comment_sort_order>  
          <long_desc isprivate="0" >
    <commentid>16049</commentid>
    <comment_count>0</comment_count>
    <who name="Saul Wold">sgw</who>
    <bug_when>2011-09-06 08:58:49 +0000</bug_when>
    <thetext>liburi-perl, libxml-sax-perl, libxml-namespacesupport-perl, linxml-parser-perl all fail in a similar fashion:

ERROR: Logfile of failure stored in: /srv/home/pokybuild/yocto-autobuilder/yocto-slave/nightly-mips/build/build/tmp/work/mips-poky-linux/liburi-perl-1.58-r1/temp/log.do_compile.13420
Log data follows:
| NOTE: make -j 16 -e MAKEFLAGS= PASTHRU_INC= -O2 -pipe -g -feliminate-unused-debug-types CCFLAGS= -O2 -pipe -g -feliminate-unused-debug-types LD=ccache mips-poky-linux-gcc  -meb -mabi=32   -mhard-float -march=mips32 --sysroot=/srv/home/pokybuild/yocto-autobuilder/yocto-slave/nightly-mips/build/build/tmp/sysroots/qemumips
| Can&apos;t locate ExtUtils/Command.pm in @INC (@INC contains: /srv/home/pokybuild/yocto-autobuilder/yocto-slave/nightly-x86/build/build/tmp/sysroots/x86_64-linux/usr/lib/perl-native/perl/5.12.3 /srv/home/pokybuild/yocto-autobuilder/yocto-slave/nightly-x86/build/build/tmp/sysroots/x86_64-linux/usr/lib/perl-native/perl/5.12.3 /srv/home/pokybuild/yocto-autobuilder/yocto-slave/nightly-x86/build/build/tmp/sysroots/x86_64-linux/usr/lib/perl-native/perl/5.12.3 .).
| BEGIN failed--compilation aborted.
| Can&apos;t locate ExtUtils/Command.pm in @INC (@INC contains: /srv/home/pokybuild/yocto-autobuilder/yocto-slave/nightly-x86/build/build/tmp/sysroots/x86_64-linux/usr/lib/perl-native/perl/5.12.3 /srv/home/pokybuild/yocto-autobuilder/yocto-slave/nightly-x86/build/build/tmp/sysroots/x86_64-linux/usr/lib/perl-native/perl/5.12.3 /srv/home/pokybuild/yocto-autobuilder/yocto-slave/nightly-x86/build/build/tmp/sysroots/x86_64-linux/usr/lib/perl-native/perl/5.12.3 .).
| BEGIN failed--compilation aborted.
| Can&apos;t locate ExtUtils/Command.pm in @INC (@INC contains: /srv/home/pokybuild/yocto-autobuilder/yocto-slave/nightly-x86/build/build/tmp/sysroots/x86_64-linux/usr/lib/perl-native/perl/5.12.3 /srv/home/pokybuild/yocto-autobuilder/yocto-slave/nightly-x86/build/build/tmp/sysroots/x86_64-linux/usr/lib/perl-native/perl/5.12.3 /srv/home/pokybuild/yocto-autobuilder/yocto-slave/nightly-x86/build/build/tmp/sysroots/x86_64-linux/usr/lib/perl-native/perl/5.12.3 .).
| BEGIN failed--compilation aborted.
| Can&apos;t locate ExtUtils/Command.pm in @INC (@INC contains: /srv/home/pokybuild/yocto-autobuilder/yocto-slave/nightly-x86/build/build/tmp/sysroots/x86_64-linux/usr/lib/perl-native/perl/5.12.3 /srv/home/pokybuild/yocto-autobuilder/yocto-slave/nightly-x86/build/build/tmp/sysroots/x86_64-linux/usr/lib/perl-native/perl/5.12.3 /srv/home/pokybuild/yocto-autobuilder/yocto-slave/nightly-x86/build/build/tmp/sysroots/x86_64-linux/usr/lib/perl-native/perl/5.12.3 .).
| BEGIN failed--compilation aborted.
| Can&apos;t locate ExtUtils/Command.pm in @INC (@INC contains: /srv/home/pokybuild/yocto-autobuilder/yocto-slave/nightly-x86/build/build/tmp/sysroots/x86_64-linux/usr/lib/perl-native/perl/5.12.3 /srv/home/pokybuild/yocto-autobuilder/yocto-slave/nightly-x86/build/build/tmp/sysroots/x86_64-linux/usr/lib/perl-native/perl/5.12.3 /srv/home/pokybuild/yocto-autobuilder/yocto-slave/nightly-x86/build/build/tmp/sysroots/x86_64-linux/usr/lib/perl-native/perl/5.12.3 .).
| BEGIN failed--compilation aborted.
| Can&apos;t locate ExtUtils/Command.pm in @INC (@INC contains: /srv/home/pokybuild/yocto-autobuilder/yocto-slave/nightly-x86/build/build/tmp/sysroots/x86_64-linux/usr/lib/perl-native/perl/5.12.3 /srv/home/pokybuild/yocto-autobuilder/yocto-slave/nightly-x86/build/build/tmp/sysroots/x86_64-linux/usr/lib/perl-native/perl/5.12.3 /srv/home/pokybuild/yocto-autobuilder/yocto-slave/nightly-x86/build/build/tmp/sysroots/x86_64-linux/usr/lib/perl-native/perl/5.12.3 .).
| BEGIN failed--compilation aborted.
| Can&apos;t locate ExtUtils/Command.pm in @INC (@INC contains: /srv/home/pokybuild/yocto-autobuilder/yocto-slave/nightly-x86/build/build/tmp/sysroots/x86_64-linux/usr/lib/perl-native/perl/5.12.3 /srv/home/pokybuild/yocto-autobuilder/yocto-slave/nightly-x86/build/build/tmp/sysroots/x86_64-linux/usr/lib/perl-native/perl/5.12.3 /srv/home/pokybuild/yocto-autobuilder/yocto-slave/nightly-x86/build/build/tmp/sysroots/x86_64-linux/usr/lib/perl-native/perl/5.12.3 .).
| BEGIN failed--compilation aborted.
| Can&apos;t locate ExtUtils/Command.pm in @INC (@INC contains: /srv/home/pokybuild/yocto-autobuilder/yocto-slave/nightly-x86/build/build/tmp/sysroots/x86_64-linux/usr/lib/perl-native/perl/5.12.3 /srv/home/pokybuild/yocto-autobuilder/yocto-slave/nightly-x86/build/build/tmp/sysroots/x86_64-linux/usr/lib/perl-native/perl/5.12.3 /srv/homeERROR: Function &apos;do_compile&apos; failed (see /srv/home/pokybuild/yocto-autobuilder/yocto-slave/nightly-mips/build/build/tmp/work/mips-poky-linux/liburi-perl-1.58-r1/temp/log.do_compile.13420 for further information)
| /pokybuild/yocto-autobuilder/yocto-slave/nightly-x86/build/build/tmp/sysroots/x86_64-linux/usr/lib/perl-native/perl/5.12.3 .).
| BEGIN failed--compilation aborted.
| make: *** [blib/lib/.exists] Error 2
| make: *** Waiting for unfinished jobs....
| make: *** [blib/arch/.exists] Error 2
| make: *** [blib/lib/auto/URI/.exists] Error 2
| make: *** [blib/arch/auto/URI/.exists] Error 2
| make: *** [blib/bin/.exists] Error 2
| make: *** [blib/script/.exists] Error 2
| make: *** [blib/man1/.exists] Error 2
| make: *** [blib/man3/.exists] Error 2
| ERROR: oe_runmake failed
NOTE: package liburi-perl-1.58-r1: task do_compile: Failed
ERROR: Task 2687 (/srv/home/pokybuild/yocto-autobuilder/yocto-slave/nightly-mips/build/meta/recipes-devtools/perl/liburi-perl_1.58.bb, do_compile) failed with exit code &apos;1&apos;</thetext>
  </long_desc><long_desc isprivate="0" >
    <commentid>16085</commentid>
    <comment_count>1</comment_count>
    <who name="Saul Wold">sgw</who>
    <bug_when>2011-09-07 17:43:29 +0000</bug_when>
    <thetext>http://git.yoctoproject.org/cgit/cgit.cgi/poky/commit/?id=4669760ac14bd28c5cfa554b8d5a9d82a26e0f52</thetext>
  </long_desc>
      
      

    </bug>

</bugzilla>