<?xml version="1.0" encoding="UTF-8" standalone="yes" ?>
<!DOCTYPE bugzilla SYSTEM "https://bugzilla.yoctoproject.org/page.cgi?id=bugzilla.dtd">

<bugzilla version="5.0.6"
          urlbase="https://bugzilla.yoctoproject.org/"
          
          maintainer="it-coreprojects-helpdesk@linuxfoundation.org"
>

    <bug>
          <bug_id>14600</bug_id>
          
          <creation_ts>2021-10-13 09:26:56 +0000</creation_ts>
          <short_desc>libnewt is not reproductible</short_desc>
          <delta_ts>2021-10-14 14:45:54 +0000</delta_ts>
          <reporter_accessible>1</reporter_accessible>
          <cclist_accessible>1</cclist_accessible>
          <classification_id>7</classification_id>
          <classification>Build System, Metadata &amp; Runtime</classification>
          <product>OE-Core</product>
          <component>core</component>
          <version>unspecified</version>
          <rep_platform>x86</rep_platform>
          <op_sys>Multiple</op_sys>
          <bug_status>RESOLVED</bug_status>
          <resolution>FIXED</resolution>
          
          
          <bug_file_loc></bug_file_loc>
          <status_whiteboard></status_whiteboard>
          <keywords></keywords>
          <priority>Undecided</priority>
          <bug_severity>normal</bug_severity>
          <target_milestone>---</target_milestone>
          
          
          <everconfirmed>1</everconfirmed>
          <reporter name="Thomas Perrot">thomas.perrot</reporter>
          <assigned_to name="Unassigned">unassigned</assigned_to>
          <cc>meta.mr.watcher</cc>
    
    <cc>meta.watcher</cc>
    
    <cc>richard.purdie</cc>
          
          
          <cf_os>---</cf_os>
          <cf_regression_type>---</cf_regression_type>
          
          <cf_docchange>No (bug/feature does not impact docs)</cf_docchange>

      

      

      

          <comment_sort_order>oldest_to_newest</comment_sort_order>  
          <long_desc isprivate="0" >
    <commentid>91728</commentid>
    <comment_count>0</comment_count>
    <who name="Thomas Perrot">thomas.perrot</who>
    <bug_when>2021-10-13 09:26:56 +0000</bug_when>
    <thetext>https://autobuilder.yoctoproject.org/typhoon/#/builders/117/builds/254/steps/12/logs/stdio

2021-10-12 00:04:15,440 - oe-selftest - INFO - ======================================================================
2021-10-12 00:04:15,440 - oe-selftest - INFO - FAIL: test_reproducible_builds (reproducible.ReproducibleTests)
2021-10-12 00:04:15,440 - oe-selftest - INFO - ----------------------------------------------------------------------
2021-10-12 00:04:15,440 - oe-selftest - INFO - Traceback (most recent call last):
  File &quot;/home/pokybuild/yocto-worker/reproducible/build/meta/lib/oeqa/selftest/cases/reproducible.py&quot;, line 332, in test_reproducible_builds
    self.fail(&apos;\n&apos;.join(fails))
AssertionError: The following deb packages are missing or different and not in exclusion list: /home/pokybuild/yocto-worker/reproducible/build/build-st/reproducibleB/tmp/deploy/deb/./core2-64/libnewt-dbg_0.52.21-r0_amd64.deb
/home/pokybuild/yocto-worker/reproducible/build/build-st/reproducibleB/tmp/deploy/deb/./core2-64/libnewt-python_0.52.21-r0_amd64.deb
/home/pokybuild/yocto-worker/reproducible/build/build-st/reproducibleB/tmp/deploy/deb/./core2-64/libxml2-dbg_2.9.12-r0_amd64.deb
/home/pokybuild/yocto-worker/reproducible/build/build-st/reproducibleB/tmp/deploy/deb/./core2-64/libxml2-ptest_2.9.12-r0_amd64.deb
/home/pokybuild/yocto-worker/reproducible/build/build-st/reproducibleB/tmp/deploy/deb/./core2-64/libxml2-python_2.9.12-r0_amd64.deb
The following ipk packages are missing or different and not in exclusion list: /home/pokybuild/yocto-worker/reproducible/build/build-st/reproducibleB/tmp/deploy/ipk/./core2-64/libnewt-dbg_0.52.21-r0_core2-64.ipk
/home/pokybuild/yocto-worker/reproducible/build/build-st/reproducibleB/tmp/deploy/ipk/./core2-64/libnewt-python_0.52.21-r0_core2-64.ipk
/home/pokybuild/yocto-worker/reproducible/build/build-st/reproducibleB/tmp/deploy/ipk/./core2-64/libxml2-dbg_2.9.12-r0_core2-64.ipk
/home/pokybuild/yocto-worker/reproducible/build/build-st/reproducibleB/tmp/deploy/ipk/./core2-64/libxml2-ptest_2.9.12-r0_core2-64.ipk
/home/pokybuild/yocto-worker/reproducible/build/build-st/reproducibleB/tmp/deploy/ipk/./core2-64/libxml2-python_2.9.12-r0_core2-64.ipk
The following rpm packages are missing or different and not in exclusion list: /home/pokybuild/yocto-worker/reproducible/build/build-st/reproducibleB/tmp/deploy/rpm/./core2_64/libnewt-dbg-0.52.21-r0.core2_64.rpm
/home/pokybuild/yocto-worker/reproducible/build/build-st/reproducibleB/tmp/deploy/rpm/./core2_64/libnewt-python-0.52.21-r0.core2_64.rpm
/home/pokybuild/yocto-worker/reproducible/build/build-st/reproducibleB/tmp/deploy/rpm/./core2_64/libxml2-dbg-2.9.12-r0.core2_64.rpm
/home/pokybuild/yocto-worker/reproducible/build/build-st/reproducibleB/tmp/deploy/rpm/./core2_64/libxml2-ptest-2.9.12-r0.core2_64.rpm
/home/pokybuild/yocto-worker/reproducible/build/build-st/reproducibleB/tmp/deploy/rpm/./core2_64/libxml2-python-2.9.12-r0.core2_64.rpm
2021-10-12 00:04:15,441 - oe-selftest - INFO - ----------------------------------------------------------------------
2021-10-12 00:04:15,441 - oe-selftest - INFO - Ran 2 tests in 17939.102s
2021-10-12 00:04:15,441 - oe-selftest - INFO - FAILED
2021-10-12 00:04:15,441 - oe-selftest - INFO -  (failures=1)
2021-10-12 00:04:24,201 - oe-selftest - INFO - RESULTS:
2021-10-12 00:04:24,202 - oe-selftest - INFO - RESULTS - reproducible.DiffoscopeTests.test_diffoscope: PASSED (86.65s)
2021-10-12 00:04:24,203 - oe-selftest - INFO - RESULTS - reproducible.ReproducibleTests.test_reproducible_builds: FAILED (17850.12s)
2021-10-12 00:04:24,595 - oe-selftest - INFO - SUMMARY:
2021-10-12 00:04:24,595 - oe-selftest - INFO - oe-selftest () - Ran 2 tests in 17939.104s
2021-10-12 00:04:24,596 - oe-selftest - INFO - oe-selftest - FAIL - Required tests failed (successes=1, skipped=0, failures=1, errors=0)</thetext>
  </long_desc><long_desc isprivate="0" >
    <commentid>91734</commentid>
    <comment_count>1</comment_count>
    <who name="Thomas Perrot">thomas.perrot</who>
    <bug_when>2021-10-13 10:01:04 +0000</bug_when>
    <thetext>https://autobuilder.yoctoproject.org/typhoon/#/builders/117/builds/255/steps/12/logs/stdio

ubuntu2004-ty-2</thetext>
  </long_desc><long_desc isprivate="0" >
    <commentid>91752</commentid>
    <comment_count>2</comment_count>
    <who name="Richard Purdie">richard.purdie</who>
    <bug_when>2021-10-14 14:45:54 +0000</bug_when>
    <thetext>http://git.yoctoproject.org/cgit.cgi/poky/commit/?id=134f8f5926fc3d7062782bc08b9d5d0430877f39
http://git.yoctoproject.org/cgit.cgi/poky/commit/?id=90ef73e8deddb525d6599e9e18f8c095d997b938</thetext>
  </long_desc>
      
      

    </bug>

</bugzilla>