<?xml version="1.0" encoding="UTF-8" standalone="yes" ?>
<!DOCTYPE bugzilla SYSTEM "https://bugzilla.yoctoproject.org/page.cgi?id=bugzilla.dtd">

<bugzilla version="5.0.6"
          urlbase="https://bugzilla.yoctoproject.org/"
          
          maintainer="it-coreprojects-helpdesk@linuxfoundation.org"
>

    <bug>
          <bug_id>14777</bug_id>
          
          <creation_ts>2022-04-06 12:19:51 +0000</creation_ts>
          <short_desc>autoconf-native do_compile failure:  m4:lib/m4sugar/m4sugar.m4f:1: expecting character `V&apos; in frozen file</short_desc>
          <delta_ts>2024-03-07 17:28:04 +0000</delta_ts>
          <reporter_accessible>1</reporter_accessible>
          <cclist_accessible>1</cclist_accessible>
          <classification_id>7</classification_id>
          <classification>Build System, Metadata &amp; Runtime</classification>
          <product>OE-Core</product>
          <component>devtools / tool chain</component>
          <version>unspecified</version>
          <rep_platform>x86</rep_platform>
          <op_sys>Multiple</op_sys>
          <bug_status>RESOLVED</bug_status>
          <resolution>WORKSFORME</resolution>
          
          
          <bug_file_loc></bug_file_loc>
          <status_whiteboard>AB-INT AB-HAVE-PLAN</status_whiteboard>
          <keywords></keywords>
          <priority>Medium</priority>
          <bug_severity>normal</bug_severity>
          <target_milestone>5.0</target_milestone>
          
          
          <everconfirmed>1</everconfirmed>
          <reporter name="Alexandre Belloni">alexandre.belloni</reporter>
          <assigned_to name="Unassigned">unassigned</assigned_to>
          <cc>alexandre.belloni</cc>
    
    <cc>changqing.li</cc>
    
    <cc>meta.mr.watcher</cc>
    
    <cc>meta.watcher</cc>
    
    <cc>randy.macleod</cc>
    
    <cc>richard.purdie</cc>
          
          
          <cf_os>---</cf_os>
          <cf_regression_type>---</cf_regression_type>
          
          <cf_docchange>No (bug/feature does not impact docs)</cf_docchange>

      

      

      

          <comment_sort_order>oldest_to_newest</comment_sort_order>  
          <long_desc isprivate="0" >
    <commentid>92933</commentid>
    <comment_count>0</comment_count>
    <who name="Alexandre Belloni">alexandre.belloni</who>
    <bug_when>2022-04-06 12:19:51 +0000</bug_when>
    <thetext>https://autobuilder.yoctoproject.org/typhoon/#/builders/117/builds/624/steps/12/logs/stdio
reproducible tumbleweed-ty-3 



| autom4te_perllibdir=&apos;../autoconf-2.71&apos;/lib AUTOM4TE_CFG=&apos;lib/autom4te.cfg&apos;         bin/autom4te -B &apos;&apos;lib -B &apos;../autoconf-2.71&apos;/lib         --language=M4sh ../autoconf-2.71/tests/wrapper.as -o tests/wrapper.in
| m4:lib/m4sugar/m4sugar.m4f:1: expecting character `V&apos; in frozen file
| autom4te: error: m4 failed with exit status: 1
| make[1]: *** [Makefile:2249: tests/wrapper.in] Error 1
| make[1]: *** Waiting for unfinished jobs....
| make[1]: Leaving directory &apos;/home/pokybuild/yocto-worker/reproducible/build/build-st/reproducibleB/tmp/work/x86_64-linux/autoconf-native/2.71-r0/build&apos;
| make: *** [Makefile:918: all] Error 2
| ERROR: oe_runmake failed
| WARNING: /home/pokybuild/yocto-worker/reproducible/build/build-st/reproducibleB/tmp/work/x86_64-linux/autoconf-native/2.71-r0/temp/run.do_compile.40589:186 exit 1 from &apos;exit 1&apos;
| WARNING: Backtrace (BB generated script):
| 	#1: bbfatal_log, /home/pokybuild/yocto-worker/reproducible/build/build-st/reproducibleB/tmp/work/x86_64-linux/autoconf-native/2.71-r0/temp/run.do_compile.40589, line 186
| 	#2: die, /home/pokybuild/yocto-worker/reproducible/build/build-st/reproducibleB/tmp/work/x86_64-linux/autoconf-native/2.71-r0/temp/run.do_compile.40589, line 170
| 	#3: oe_runmake, /home/pokybuild/yocto-worker/reproducible/build/build-st/reproducibleB/tmp/work/x86_64-linux/autoconf-native/2.71-r0/temp/run.do_compile.40589, line 165
| 	#4: autotools_do_compile, /home/pokybuild/yocto-worker/reproducible/build/build-st/reproducibleB/tmp/work/x86_64-linux/autoconf-native/2.71-r0/temp/run.do_compile.40589, line 160
| 	#5: do_compile, /home/pokybuild/yocto-worker/reproducible/build/build-st/reproducibleB/tmp/work/x86_64-linux/autoconf-native/2.71-r0/temp/run.do_compile.40589, line 155
| 	#6: main, /home/pokybuild/yocto-worker/reproducible/build/build-st/reproducibleB/tmp/work/x86_64-linux/autoconf-native/2.71-r0/temp/run.do_compile.40589, line 199
NOTE: recipe autoconf-native-2.71-r0: task do_compile: Failed</thetext>
  </long_desc><long_desc isprivate="0" >
    <commentid>92942</commentid>
    <comment_count>1</comment_count>
    <who name="Randy MacLeod">randy.macleod</who>
    <bug_when>2022-04-07 14:43:55 +0000</bug_when>
    <thetext>Hopefully a rare race.</thetext>
  </long_desc><long_desc isprivate="0" >
    <commentid>93014</commentid>
    <comment_count>2</comment_count>
    <who name="Richard Purdie">richard.purdie</who>
    <bug_when>2022-04-12 21:27:50 +0000</bug_when>
    <thetext>Seen once in Windriver internal builds too, so rare but has been seen by others.</thetext>
  </long_desc><long_desc isprivate="0" >
    <commentid>93526</commentid>
    <comment_count>3</comment_count>
    <who name="Randy MacLeod">randy.macleod</who>
    <bug_when>2022-06-16 15:07:30 +0000</bug_when>
    <thetext>Sandy, If we see this in the WRAXL build failures, please add a comment and ideally some debug code or a fix! ;)</thetext>
  </long_desc><long_desc isprivate="0" >
    <commentid>97130</commentid>
    <comment_count>4</comment_count>
    <who name="Randy MacLeod">randy.macleod</who>
    <bug_when>2023-10-30 15:37:29 +0000</bug_when>
    <thetext>Build move to 5.0 -- ../Randy</thetext>
  </long_desc><long_desc isprivate="0" >
    <commentid>98427</commentid>
    <comment_count>5</comment_count>
    <who name="Randy MacLeod">randy.macleod</who>
    <bug_when>2024-03-07 17:28:04 +0000</bug_when>
    <thetext>Not seen in ~ 2 years.</thetext>
  </long_desc>
      
      

    </bug>

</bugzilla>