<?xml version="1.0" encoding="UTF-8" standalone="yes" ?>
<!DOCTYPE bugzilla SYSTEM "https://bugzilla.yoctoproject.org/page.cgi?id=bugzilla.dtd">

<bugzilla version="5.0.6"
          urlbase="https://bugzilla.yoctoproject.org/"
          
          maintainer="it-coreprojects-helpdesk@linuxfoundation.org"
>

    <bug>
          <bug_id>14825</bug_id>
          
          <creation_ts>2022-06-03 12:03:49 +0000</creation_ts>
          <short_desc>AB-INT PTEST: tcl socket.test failure</short_desc>
          <delta_ts>2023-12-13 16:48:54 +0000</delta_ts>
          <reporter_accessible>1</reporter_accessible>
          <cclist_accessible>1</cclist_accessible>
          <classification_id>10</classification_id>
          <classification>QA/Testing</classification>
          <product>Package Testing (ptest)</product>
          <component>ptest</component>
          <version>unspecified</version>
          <rep_platform>x86</rep_platform>
          <op_sys>Multiple</op_sys>
          <bug_status>RESOLVED</bug_status>
          <resolution>FIXED</resolution>
          
          
          <bug_file_loc></bug_file_loc>
          <status_whiteboard>AB-INT</status_whiteboard>
          <keywords></keywords>
          <priority>Medium+</priority>
          <bug_severity>normal</bug_severity>
          <target_milestone>5.0</target_milestone>
          
          
          <everconfirmed>1</everconfirmed>
          <reporter name="Luca Ceresoli">luca.ceresoli</reporter>
          <assigned_to name="Ross Burton">ross.burton</assigned_to>
          <cc>alexandre.belloni</cc>
    
    <cc>chee.yang.lee</cc>
    
    <cc>luca.ceresoli</cc>
    
    <cc>randy.macleod</cc>
    
    <cc>richard.purdie</cc>
          
          
          <cf_os>---</cf_os>
          <cf_regression_type>---</cf_regression_type>
          
          <cf_docchange>No (bug/feature does not impact docs)</cf_docchange>

      

      

      

          <comment_sort_order>oldest_to_newest</comment_sort_order>  
          <long_desc isprivate="0" >
    <commentid>93395</commentid>
    <comment_count>0</comment_count>
    <who name="Luca Ceresoli">luca.ceresoli</who>
    <bug_when>2022-06-03 12:03:49 +0000</bug_when>
    <thetext>Seen this tcl failure once:

  AssertionError: Failed ptests:
  {&apos;openssl&apos;: [&apos;Dubious,_test_returned_1&apos;], &apos;tcl&apos;: [&apos;socket.test&apos;]}

(the openssl one is a separate issue, already solved)

qemux86-64-ptest on ubuntu1604-ty-1

https://autobuilder.yoctoproject.org/typhoon/#/builders/81/builds/3565/steps/13/logs/stdio

From https://autobuilder.yocto.io/pub/non-release/20220601-9/testresults/qemux86-64-ptest/tcl.log :

-------------------8&lt;-------------------
FAIL: socket.test
Tests running in interp:  /usr/lib/tcl/ptest/tcltest
Tests located in:  /usr/lib/tcl/ptest/tests
Tests running in:  /usr/lib/tcl/ptest
Temporary files stored in /usr/lib/tcl/ptest
Test files run in separate interpreters
Running tests that match:  *
Skipping test files that match:  l.*.test
Only running test files that match:  socket.test
Tests began at Wed Jun 01 13:01:00 BST 2022
socket.test


==== socket-14.14 testing fileevent readable on failed async socket connect FAILED
==== Contents of test case:

    # Test for bug 581937ab1e
    set a1 [after $latency {set x timeout}]
    # This connect should fail
    set s [socket -async localhost [randport]]
    fileevent $s readable {set x readable}
    vwait x
    set x

---- Result was:
timeout
---- Result should have been (exact matching):
readable
==== socket-14.14 FAILED


Tests ended at Wed Jun 01 13:01:07 BST 2022
all.tcl:	Total	173	Passed	156	Skipped	16	Failed	1
Sourced 1 Test Files.
Files with failing tests: socket.test
Number of tests skipped for each constraint:
	1	nonPortable
	4	notRoot
	10	thread
	1	win
-------------------8&lt;-------------------

Similar, but not equal, to: https://bugzilla.yoctoproject.org/show_bug.cgi?id=14488</thetext>
  </long_desc><long_desc isprivate="0" >
    <commentid>93441</commentid>
    <comment_count>1</comment_count>
    <who name="Randy MacLeod">randy.macleod</who>
    <bug_when>2022-06-09 14:36:45 +0000</bug_when>
    <thetext>We should disable this test. Ross gets the bug as our resident TCL expert!</thetext>
  </long_desc><long_desc isprivate="0" >
    <commentid>93515</commentid>
    <comment_count>2</comment_count>
    <who name="Alexandre Belloni">alexandre.belloni</who>
    <bug_when>2022-06-16 14:07:44 +0000</bug_when>
    <thetext>https://autobuilder.yoctoproject.org/typhoon/#/builders/82/builds/3343/steps/12/logs/stdio

qemuarm64-ptest ubuntu1804-arm-1</thetext>
  </long_desc><long_desc isprivate="0" >
    <commentid>94056</commentid>
    <comment_count>3</comment_count>
    <who name="Richard Purdie">richard.purdie</who>
    <bug_when>2022-09-22 14:43:12 +0000</bug_when>
    <thetext>We probably want to disable this test so we can close the issue as it will likely come back.</thetext>
  </long_desc><long_desc isprivate="0" >
    <commentid>94059</commentid>
    <comment_count>4</comment_count>
    <who name="Ross Burton">ross.burton</who>
    <bug_when>2022-09-22 15:08:32 +0000</bug_when>
    <thetext>From the little tcl I know, this shouldn&apos;t be load-sensitive so we should be able to keep it.  I&apos;ll ask the TCL people for advice but we&apos;re not seeing it often so this isn&apos;t a high priority fix.</thetext>
  </long_desc><long_desc isprivate="0" >
    <commentid>94142</commentid>
    <comment_count>5</comment_count>
    <who name="Ross Burton">ross.burton</who>
    <bug_when>2022-10-13 14:29:30 +0000</bug_when>
    <thetext>Hasn&apos;t happened for a while.</thetext>
  </long_desc><long_desc isprivate="0" >
    <commentid>94419</commentid>
    <comment_count>6</comment_count>
    <who name="Alexandre Belloni">alexandre.belloni</who>
    <bug_when>2022-11-16 11:07:42 +0000</bug_when>
    <thetext>https://autobuilder.yoctoproject.org/typhoon/#builders/81/builds/4267/steps/12/logs/stdio

qemux86-64-ptest debian11-ty-3</thetext>
  </long_desc><long_desc isprivate="0" >
    <commentid>94910</commentid>
    <comment_count>7</comment_count>
    <who name="Randy MacLeod">randy.macleod</who>
    <bug_when>2023-02-09 15:48:53 +0000</bug_when>
    <thetext>Not seen in a while.
If it happens again, we&apos;ll just disable some of the socket tests case.</thetext>
  </long_desc><long_desc isprivate="0" >
    <commentid>96021</commentid>
    <comment_count>8</comment_count>
    <who name="Alexandre Belloni">alexandre.belloni</who>
    <bug_when>2023-07-23 22:39:46 +0000</bug_when>
    <thetext>https://autobuilder.yoctoproject.org/typhoon/#/builders/81/builds/5200/steps/12/logs/stdio

qemux86-64-ptest ubuntu2204-ty-3


https://autobuilder.yoctoproject.org/typhoon/#/builders/81/builds/5315/steps/12/logs/stdio

qemux86-64-ptest fedora38-ty-1</thetext>
  </long_desc><long_desc isprivate="0" >
    <commentid>96367</commentid>
    <comment_count>9</comment_count>
    <who name="Alexandre Belloni">alexandre.belloni</who>
    <bug_when>2023-09-07 16:36:13 +0000</bug_when>
    <thetext>https://autobuilder.yoctoproject.org/typhoon/#/builders/81/builds/5547/steps/12/logs/stdio

qemux86-64-ptest debian11-ty-1</thetext>
  </long_desc><long_desc isprivate="0" >
    <commentid>96638</commentid>
    <comment_count>10</comment_count>
    <who name="Alexandre Belloni">alexandre.belloni</who>
    <bug_when>2023-10-05 20:51:02 +0000</bug_when>
    <thetext>https://autobuilder.yoctoproject.org/typhoon/#/builders/82/builds/5420/steps/13/logs/stdio

qemuarm64-ptest ubuntu1804-arm-1</thetext>
  </long_desc><long_desc isprivate="0" >
    <commentid>96639</commentid>
    <comment_count>11</comment_count>
    <who name="Alexandre Belloni">alexandre.belloni</who>
    <bug_when>2023-10-05 20:53:22 +0000</bug_when>
    <thetext>https://autobuilder.yoctoproject.org/typhoon/#/builders/82/builds/5414/steps/13/logs/stdio

qemuarm64-ptest ubuntu1804-arm-1 1</thetext>
  </long_desc><long_desc isprivate="0" >
    <commentid>97446</commentid>
    <comment_count>12</comment_count>
    <who name="Ross Burton">ross.burton</who>
    <bug_when>2023-12-07 22:20:32 +0000</bug_when>
    <thetext>Patch to add skips sent.</thetext>
  </long_desc><long_desc isprivate="0" >
    <commentid>97480</commentid>
    <comment_count>13</comment_count>
    <who name="Alexandre Belloni">alexandre.belloni</who>
    <bug_when>2023-12-09 23:55:04 +0000</bug_when>
    <thetext>https://autobuilder.yoctoproject.org/typhoon/#/builders/82/builds/5700/steps/13/logs/stdio

qemuarm64-ptest ubuntu1804-arm-1</thetext>
  </long_desc><long_desc isprivate="0" >
    <commentid>97530</commentid>
    <comment_count>14</comment_count>
    <who name="Chee Yang">chee.yang.lee</who>
    <bug_when>2023-12-12 06:24:44 +0000</bug_when>
    <thetext>https://autobuilder.yoctoproject.org/typhoon/#/builders/81/builds/6029/steps/13/logs/stdio
qemux86-64-ptest   fedora38-ty-4
this is also 3.1.30.rc2 build</thetext>
  </long_desc><long_desc isprivate="0" >
    <commentid>97554</commentid>
    <comment_count>15</comment_count>
    <who name="Ross Burton">ross.burton</who>
    <bug_when>2023-12-13 16:48:54 +0000</bug_when>
    <thetext>Hopefully fixed in 68beb4f4b5a0bea5d431decddf7656f18ac7a04a.</thetext>
  </long_desc>
      
      

    </bug>

</bugzilla>