<?xml version="1.0" encoding="UTF-8" standalone="yes" ?>
<!DOCTYPE bugzilla SYSTEM "https://bugzilla.yoctoproject.org/page.cgi?id=bugzilla.dtd">

<bugzilla version="5.0.6"
          urlbase="https://bugzilla.yoctoproject.org/"
          
          maintainer="it-coreprojects-helpdesk@linuxfoundation.org"
>

    <bug>
          <bug_id>14860</bug_id>
          
          <creation_ts>2022-07-12 11:40:37 +0000</creation_ts>
          <short_desc>Cannot build x86-64 Go SDK on aarch64</short_desc>
          <delta_ts>2023-12-21 21:56:13 +0000</delta_ts>
          <reporter_accessible>1</reporter_accessible>
          <cclist_accessible>1</cclist_accessible>
          <classification_id>7</classification_id>
          <classification>Build System, Metadata &amp; Runtime</classification>
          <product>OE-Core</product>
          <component>devtools / tool chain</component>
          <version>4.2</version>
          <rep_platform>x86</rep_platform>
          <op_sys>Multiple</op_sys>
          <bug_status>RESOLVED</bug_status>
          <resolution>FIXED</resolution>
          
          
          <bug_file_loc></bug_file_loc>
          <status_whiteboard></status_whiteboard>
          <keywords></keywords>
          <priority>Medium+</priority>
          <bug_severity>normal</bug_severity>
          <target_milestone>5.0 M2</target_milestone>
          
          
          <everconfirmed>1</everconfirmed>
          <reporter name="Ross Burton">ross.burton</reporter>
          <assigned_to name="Unassigned">unassigned</assigned_to>
          <cc>meta.mr.watcher</cc>
    
    <cc>meta.watcher</cc>
    
    <cc>raj.khem</cc>
    
    <cc>randy.macleod</cc>
    
    <cc>tgamblin</cc>
          
          
          <cf_os>---</cf_os>
          <cf_regression_type>---</cf_regression_type>
          
          <cf_docchange>No (bug/feature does not impact docs)</cf_docchange>

      

      

      

          <comment_sort_order>oldest_to_newest</comment_sort_order>  
          <long_desc isprivate="0" >
    <commentid>93662</commentid>
    <comment_count>0</comment_count>
    <who name="Ross Burton">ross.burton</who>
    <bug_when>2022-07-12 11:40:37 +0000</bug_when>
    <thetext>When building a Go SDK on an aarch64 host with MACHINE=qemux86-64 SDKMACHINE=x86-64, the build fails:

$ MACHINE=qemux86-64 bitbake meta-go-toolchain
...
| # cmd/go
| /yocto/ross/build/tmp/work/x86_64-nativesdk-pokysdk-linux/go-cross-canadian-x86-64/1.18.3-r0/go/pkg/tool/native_native/link: running x86_64-pokysdk-linux-gcc failed: exit status 1
| /yocto/ross/build/tmp/work/x86_64-nativesdk-pokysdk-linux/go-cross-canadian-x86-64/1.18.3-r0/recipe-sysroot-native/usr/bin/x86_64-pokysdk-linux/../../libexec/x86_64-pokysdk-linux/gcc/x86_64-pokysdk-linux/12.1.0/ld: /tmp/go-link-842575422/go.o: Relocations in generic ELF (EM: 183)
| /yocto/ross/build/tmp/work/x86_64-nativesdk-pokysdk-linux/go-cross-canadian-x86-64/1.18.3-r0/recipe-sysroot-native/usr/bin/x86_64-pokysdk-linux/../../libexec/x86_64-pokysdk-linux/gcc/x86_64-pokysdk-linux/12.1.0/ld: /tmp/go-link-842575422/go.o: Relocations in generic ELF (EM: 183)
| /yocto/ross/build/tmp/work/x86_64-nativesdk-pokysdk-linux/go-cross-canadian-x86-64/1.18.3-r0/recipe-sysroot-native/usr/bin/x86_64-pokysdk-linux/../../libexec/x86_64-pokysdk-linux/gcc/x86_64-pokysdk-linux/12.1.0/ld: /tmp/go-link-842575422/go.o: Relocations in generic ELF (EM: 183)
| /yocto/ross/build/tmp/work/x86_64-nativesdk-pokysdk-linux/go-cross-canadian-x86-64/1.18.3-r0/recipe-sysroot-native/usr/bin/x86_64-pokysdk-linux/../../libexec/x86_64-pokysdk-linux/gcc/x86_64-pokysdk-linux/12.1.0/ld: /tmp/go-link-842575422/go.o: Relocations in generic ELF (EM: 183)
| /yocto/ross/build/tmp/work/x86_64-nativesdk-pokysdk-linux/go-cross-canadian-x86-64/1.18.3-r0/recipe-sysroot-native/usr/bin/x86_64-pokysdk-linux/../../libexec/x86_64-pokysdk-linux/gcc/x86_64-pokysdk-linux/12.1.0/ld: /tmp/go-link-842575422/go.o: Relocations in generic ELF (EM: 183)
| /yocto/ross/build/tmp/work/x86_64-nativesdk-pokysdk-linux/go-cross-canadian-x86-64/1.18.3-r0/recipe-sysroot-native/usr/bin/x86_64-pokysdk-linux/../../libexec/x86_64-pokysdk-linux/gcc/x86_64-pokysdk-linux/12.1.0/ld: /tmp/go-link-842575422/go.o: Relocations in generic ELF (EM: 183)
| /yocto/ross/build/tmp/work/x86_64-nativesdk-pokysdk-linux/go-cross-canadian-x86-64/1.18.3-r0/recipe-sysroot-native/usr/bin/x86_64-pokysdk-linux/../../libexec/x86_64-pokysdk-linux/gcc/x86_64-pokysdk-linux/12.1.0/ld: /tmp/go-link-842575422/go.o: Relocations in generic ELF (EM: 183)
| /yocto/ross/build/tmp/work/x86_64-nativesdk-pokysdk-linux/go-cross-canadian-x86-64/1.18.3-r0/recipe-sysroot-native/usr/bin/x86_64-pokysdk-linux/../../libexec/x86_64-pokysdk-linux/gcc/x86_64-pokysdk-linux/12.1.0/ld: /tmp/go-link-842575422/go.o: Relocations in generic ELF (EM: 183)
| /yocto/ross/build/tmp/work/x86_64-nativesdk-pokysdk-linux/go-cross-canadian-x86-64/1.18.3-r0/recipe-sysroot-native/usr/bin/x86_64-pokysdk-linux/../../libexec/x86_64-pokysdk-linux/gcc/x86_64-pokysdk-linux/12.1.0/ld: /tmp/go-link-842575422/go.o: Relocations in generic ELF (EM: 183)
| /yocto/ross/build/tmp/work/x86_64-nativesdk-pokysdk-linux/go-cross-canadian-x86-64/1.18.3-r0/recipe-sysroot-native/usr/bin/x86_64-pokysdk-linux/../../libexec/x86_64-pokysdk-linux/gcc/x86_64-pokysdk-linux/12.1.0/ld: /tmp/go-link-842575422/go.o: Relocations in generic ELF (EM: 183)
| /yocto/ross/build/tmp/work/x86_64-nativesdk-pokysdk-linux/go-cross-canadian-x86-64/1.18.3-r0/recipe-sysroot-native/usr/bin/x86_64-pokysdk-linux/../../libexec/x86_64-pokysdk-linux/gcc/x86_64-pokysdk-linux/12.1.0/ld: /tmp/go-link-842575422/go.o: Relocations in generic ELF (EM: 183)
| /yocto/ross/build/tmp/work/x86_64-nativesdk-pokysdk-linux/go-cross-canadian-x86-64/1.18.3-r0/recipe-sysroot-native/usr/bin/x86_64-pokysdk-linux/../../libexec/x86_64-pokysdk-linux/gcc/x86_64-pokysdk-linux/12.1.0/ld: /tmp/go-link-842575422/go.o: Relocations in generic ELF (EM: 183)
| /yocto/ross/build/tmp/work/x86_64-nativesdk-pokysdk-linux/go-cross-canadian-x86-64/1.18.3-r0/recipe-sysroot-native/usr/bin/x86_64-pokysdk-linux/../../libexec/x86_64-pokysdk-linux/gcc/x86_64-pokysdk-linux/12.1.0/ld: /tmp/go-link-842575422/go.o: Relocations in generic ELF (EM: 183)
| /yocto/ross/build/tmp/work/x86_64-nativesdk-pokysdk-linux/go-cross-canadian-x86-64/1.18.3-r0/recipe-sysroot-native/usr/bin/x86_64-pokysdk-linux/../../libexec/x86_64-pokysdk-linux/gcc/x86_64-pokysdk-linux/12.1.0/ld: /tmp/go-link-842575422/go.o: Relocations in generic ELF (EM: 183)
| /yocto/ross/build/tmp/work/x86_64-nativesdk-pokysdk-linux/go-cross-canadian-x86-64/1.18.3-r0/recipe-sysroot-native/usr/bin/x86_64-pokysdk-linux/../../libexec/x86_64-pokysdk-linux/gcc/x86_64-pokysdk-linux/12.1.0/ld: /tmp/go-link-842575422/go.o: Relocations in generic ELF (EM: 183)
| /yocto/ross/build/tmp/work/x86_64-nativesdk-pokysdk-linux/go-cross-canadian-x86-64/1.18.3-r0/recipe-sysroot-native/usr/bin/x86_64-pokysdk-linux/../../libexec/x86_64-pokysdk-linux/gcc/x86_64-pokysdk-linux/12.1.0/ld: /tmp/go-link-842575422/go.o: Relocations in generic ELF (EM: 183)
| /yocto/ross/build/tmp/work/x86_64-nativesdk-pokysdk-linux/go-cross-canadian-x86-64/1.18.3-r0/recipe-sysroot-native/usr/bin/x86_64-pokysdk-linux/../../libexec/x86_64-pokysdk-linux/gcc/x86_64-pokysdk-linux/12.1.0/ld: /tmp/go-link-842575422/go.o: error adding symbols: file in wrong format
| collect2: error: ld returned 1 exit status
|
| go tool dist: FAILED: /yocto/ross/build/tmp/work/x86_64-nativesdk-pokysdk-linux/go-cross-canadian-x86-64/1.18.3-r0/go/pkg/tool/native_native/go_bootstrap install -gcflags=all= -ldflags=all=-linkmode external -extld x86_64-pokysdk-linux-gcc -extldflags &quot;--sysroot=/yocto/ross/build/tmp/work/x86_64-nativesdk-pokysdk-linux/go-cross-canadian-x86-64/1.18.3-r0/recipe-sysroot -no-pie -fno-PIE  -Wl,-O1            -Wl,-rpath-link,/yocto/ross/build/tmp/work/x86_64-nativesdk-pokysdk-linux/go-cross-canadian-x86-64/1.18.3-r0/recipe-sysroot/usr/local/oe-sdk-hardcoded-buildpath/sysroots/x86_64-pokysdk-linux/usr/lib/x86_64-poky-linux/..            -Wl,-rpath,/usr/local/oe-sdk-hardcoded-buildpath/sysroots/x86_64-pokysdk-linux/usr/lib/x86_64-poky-linux/.. &quot; std cmd: exit status 2
| WARNING: exit code 2 from a shell command.
ERROR: Task (/home/ross/Yocto/poky/meta/recipes-devtools/go/go-cross-canadian_1.18.3.bb:do_compile) failed with exit code &apos;1&apos;</thetext>
  </long_desc><long_desc isprivate="0" >
    <commentid>96067</commentid>
    <comment_count>1</comment_count>
    <who name="Randy MacLeod">randy.macleod</who>
    <bug_when>2023-07-26 21:22:00 +0000</bug_when>
    <thetext>Bulk move of 64 bugs to 4.3 M3 after a quick review.
If a bug is actually fixed, please add a commit link and resolve it.
-- Randy for YP bug team.</thetext>
  </long_desc><long_desc isprivate="0" >
    <commentid>96486</commentid>
    <comment_count>2</comment_count>
    <who name="Trevor Gamblin">tgamblin</who>
    <bug_when>2023-09-14 16:46:01 +0000</bug_when>
    <thetext>Moved to M4.</thetext>
  </long_desc><long_desc isprivate="0" >
    <commentid>97078</commentid>
    <comment_count>3</comment_count>
    <who name="Randy MacLeod">randy.macleod</who>
    <bug_when>2023-10-30 15:29:13 +0000</bug_when>
    <thetext>Bulk move to 5.0 M1. -- Randy</thetext>
  </long_desc><long_desc isprivate="0" >
    <commentid>97644</commentid>
    <comment_count>4</comment_count>
    <who name="Randy MacLeod">randy.macleod</who>
    <bug_when>2023-12-21 21:04:26 +0000</bug_when>
    <thetext>Ross is checking if this works. Moving to M2.</thetext>
  </long_desc><long_desc isprivate="0" >
    <commentid>97646</commentid>
    <comment_count>5</comment_count>
    <who name="Ross Burton">ross.burton</who>
    <bug_when>2023-12-21 21:56:13 +0000</bug_when>
    <thetext>Looks like this has been fixed.</thetext>
  </long_desc>
      
      

    </bug>

</bugzilla>