<?xml version="1.0" encoding="UTF-8" standalone="yes" ?>
<!DOCTYPE bugzilla SYSTEM "https://bugzilla.yoctoproject.org/page.cgi?id=bugzilla.dtd">

<bugzilla version="5.0.6"
          urlbase="https://bugzilla.yoctoproject.org/"
          
          maintainer="it-coreprojects-helpdesk@linuxfoundation.org"
>

    <bug>
          <bug_id>14862</bug_id>
          
          <creation_ts>2022-07-14 13:24:48 +0000</creation_ts>
          <short_desc>go-runtime build failure</short_desc>
          <delta_ts>2022-11-03 14:53:48 +0000</delta_ts>
          <reporter_accessible>1</reporter_accessible>
          <cclist_accessible>1</cclist_accessible>
          <classification_id>7</classification_id>
          <classification>Build System, Metadata &amp; Runtime</classification>
          <product>OE-Core</product>
          <component>devtools / tool chain</component>
          <version>unspecified</version>
          <rep_platform>x86</rep_platform>
          <op_sys>Multiple</op_sys>
          <bug_status>RESOLVED</bug_status>
          <resolution>WORKSFORME</resolution>
          
          
          <bug_file_loc></bug_file_loc>
          <status_whiteboard>AB-INT</status_whiteboard>
          <keywords></keywords>
          <priority>Medium</priority>
          <bug_severity>normal</bug_severity>
          <target_milestone>4.2</target_milestone>
          
          
          <everconfirmed>1</everconfirmed>
          <reporter name="Alexandre Belloni">alexandre.belloni</reporter>
          <assigned_to name="Unassigned">unassigned</assigned_to>
          <cc>alexandre.belloni</cc>
    
    <cc>meta.mr.watcher</cc>
    
    <cc>meta.watcher</cc>
    
    <cc>randy.macleod</cc>
    
    <cc>ross.burton</cc>
          
          
          <cf_os>---</cf_os>
          <cf_regression_type>---</cf_regression_type>
          
          <cf_docchange>No (bug/feature does not impact docs)</cf_docchange>

      

      

      

          <comment_sort_order>oldest_to_newest</comment_sort_order>  
          <long_desc isprivate="0" >
    <commentid>93668</commentid>
    <comment_count>0</comment_count>
    <who name="Alexandre Belloni">alexandre.belloni</who>
    <bug_when>2022-07-14 13:24:48 +0000</bug_when>
    <thetext>| # /home/pokybuild/yocto-worker/qemuarm/build/build/tmp/work/cortexa15t2hf-neon-poky-linux-gnueabi/go-runtime/1.18.3-r0/build-tmp/go-build1301124642/b232/libstd.so
| /home/pokybuild/yocto-worker/qemuarm/build/build/tmp/work/cortexa15t2hf-neon-poky-linux-gnueabi/go-runtime/1.18.3-r0/go/pkg/tool/native_native/link: running arm-poky-linux-gnueabi-gcc failed: exit status 1
| /tmp/go-link-3088828398/go.o:go.go:function local.internal/abi.(*RegArgs).IntRegArgAddr: error: unexpected opcode while processing relocation R_ARM_CALL
| /tmp/go-link-3088828398/go.o:go.go:function local.internal/abi.(*RegArgs).IntRegArgAddr: error: unexpected opcode while processing relocation R_ARM_CALL
| /tmp/go-link-3088828398/go.o:go.go:function local.internal/abi.(*RegArgs).IntRegArgAddr: error: unexpected opcode while processing relocation R_ARM_CALL
| /tmp/go-link-3088828398/go.o:go.go:function local.internal/abi.(*IntArgRegBitmap).Set: error: unexpected opcode while processing relocation R_ARM_CALL
| /tmp/go-link-3088828398/go.o:go.go:function local.internal/abi.(*IntArgRegBitmap).Set: error: unexpected opcode while processing relocation R_ARM_CALL
| /tmp/go-link-3088828398/go.o:go.go:function local.internal/abi.(*IntArgRegBitmap).Get: error: unexpected opcode while processing relocation R_ARM_CALL
| /tmp/go-link-3088828398/go.o:go.go:function local.runtime/internal/math.MulUintptr: error: unexpected opcode while processing relocation R_ARM_CALL
| /tmp/go-link-3088828398/go.o:go.go:function local.runtime/internal/math.MulUintptr: error: unexpected opcode while processing relocation R_ARM_CALL
| /tmp/go-link-3088828398/go.o:go.go:function local.runtime/internal/math.Mul64: error: unexpected opcode while processing relocation R_ARM_CALL
| /tmp/go-link-3088828398/go.o:go.go:function local.internal/bytealg.HashStrBytes: error: unexpected opcode while processing relocation R_ARM_CALL
| /tmp/go-link-3088828398/go.o:go.go:function local.internal/bytealg.HashStrBytes: error: unexpected opcode while processing relocation R_ARM_CALL
| /tmp/go-link-3088828398/go.o:go.go:function local.internal/bytealg.HashStr: error: unexpected opcode while processing relocation R_ARM_CALL
| /tmp/go-link-3088828398/go.o:go.go:function local.internal/bytealg.HashStr: error: unexpected opcode while processing relocation R_ARM_CALL
| /tmp/go-link-3088828398/go.o:go.go:function local.internal/bytealg.HashStrRevBytes: error: unexpected opcode while processing relocation R_ARM_CALL
| /tmp/go-link-3088828398/go.o:go.go:function local.internal/bytealg.HashStrRevBytes: error: unexpected opcode while processing relocation R_ARM_CALL
| /tmp/go-link-3088828398/go.o:go.go:function local.internal/bytealg.HashStrRev: error: unexpected opcode while processing relocation R_ARM_CALL
| /tmp/go-link-3088828398/go.o:go.go:function local.internal/bytealg.HashStrRev: error: unexpected opcode while processing relocation R_ARM_CALL
| /tmp/go-link-3088828398/go.o:go.go:function local.internal/bytealg.IndexRabinKarpBytes: error: unexpected opcode while processing relocation R_ARM_CALL
| /tmp/go-link-3088828398/go.o:go.go:function local.internal/bytealg.IndexRabinKarpBytes: error: unexpected opcode while processing relocation R_ARM_CALL
| /tmp/go-link-3088828398/go.o:go.go:function local.internal/bytealg.IndexRabinKarpBytes: error: unexpected opcode while processing relocation R_ARM_CALL
| /tmp/go-link-3088828398/go.o:go.go:function local.internal/bytealg.IndexRabinKarpBytes: error: unexpected opcode while processing relocation R_ARM_CALL
| /tmp/go-link-3088828398/go.o:go.go:function local.internal/bytealg.IndexRabinKarpBytes: error: unexpected opcode while processing relocation R_ARM_CALL
| /tmp/go-link-3088828398/go.o:go.go:function local.internal/bytealg.IndexRabinKarpBytes: error: unexpected opcode while processing relocation R_ARM_CALL
| /tmp/go-link-3088828398/go.o:go.go:function local.internal/bytealg.IndexRabinKarpBytes: error: unexpected opcode while processing relocation R_ARM_CALL
| /tmp/go-link-3088828398/go.o:go.go:function local.internal/bytealg.IndexRabinKarpBytes: error: unexpected opcode while processing relocation R_ARM_CALL
| /tmp/go-link-3088828398/go.o:go.go:function local.internal/bytealg.IndexRabinKarpBytes: error: unexpected opcode while processing relocation R_ARM_CALL
| /tmp/go-link-3088828398/go.o:go.go:function local.internal/bytealg.IndexRabinKarpBytes: error: unexpected opcode while processing relocation R_ARM_CALL
| /tmp/go-link-3088828398/go.o:go.go:function local.internal/bytealg.IndexRabinKarp: error: unexpected opcode while processing relocation R_ARM_CALL
| /tmp/go-link-3088828398/go.o:go.go:function local.internal/bytealg.IndexRabinKarp: error: unexpected opcode while processing relocation R_ARM_CALL
| /tmp/go-link-3088828398/go.o:go.go:function local.internal/bytealg.IndexRabinKarp: error: unexpected opcode while processing relocation R_ARM_CALL
| /tmp/go-link-3088828398/go.o:go.go:function local.internal/bytealg.IndexRabinKarp: error: unexpected opcode while processing relocation R_ARM_CALL
| /tmp/go-link-3088828398/go.o:go.go:function local.internal/bytealg.IndexRabinKarp: error: unexpected opcode while processing relocation R_ARM_CALL
| /tmp/go-link-3088828398/go.o:go.go:function local.internal/bytealg.IndexRabinKarp: error: unexpected opcode while processing relocation R_ARM_CALL
| /tmp/go-link-3088828398/go.o:go.go:function local.internal/bytealg.IndexRabinKarp: error: unexpected opcode while processing relocation R_ARM_CALL
| /tmp/go-link-3088828398/go.o:go.go:function local.internal/bytealg.IndexRabinKarp: error: unexpected opcode while processing relocation R_ARM_CALL
| /tmp/go-link-3088828398/go.o:go.go:function local.internal/bytealg.IndexRabinKarp: error: unexpected opcode while processing relocation R_ARM_CALL
| /tmp/go-link-3088828398/go.o:go.go:function local.internal/bytealg.countGenericString: error: unexpected opcode while processing relocation R_ARM_CALL
| /tmp/go-link-3088828398/go.o:go.go:function local.internal/bytealg.countGenericString: error: unexpected opcode while processing relocation R_ARM_CALL
| /tmp/go-link-3088828398/go.o:go.go:function local.internal/bytealg.Equal: error: unexpected opcode while processing relocation R_ARM_CALL
| /tmp/go-link-3088828398/go.o:go.go:function local.internal/bytealg.Equal: error: unexpected opcode while processing relocation R_ARM_CALL
| /tmp/go-link-3088828398/go.o:go.go:function local.internal/bytealg.Index: error: unexpected opcode while processing relocation R_ARM_CALL
| /tmp/go-link-3088828398/go.o:go.go:function local.internal/bytealg.Index: error: unexpected opcode while processing relocation R_ARM_CALL
| /tmp/go-link-3088828398/go.o:go.go:function local.internal/bytealg.IndexString: error: unexpected opcode while processing relocation R_ARM_CALL
| /tmp/go-link-3088828398/go.o:go.go:function local.internal/bytealg.IndexString: error: unexpected opcode while processing relocation R_ARM_CALL
| /tmp/go-link-3088828398/go.o:go.go:function local.internal/bytealg.Cutover: error: unexpected opcode while processing relocation R_ARM_CALL
| /tmp/go-link-3088828398/go.o:go.go:function local.internal/bytealg.Cutover: error: unexpected opcode while processing relocation R_ARM_CALL
| /tmp/go-link-3088828398/go.o:go.go:function local.internal/bytealg.Compare: error: unexpected opcode while processing relocation R_ARM_JUMP24
| /tmp/go-link-3088828398/go.o:go.go:function local.runtime.cmpstring: error: unexpected opcode while processing relocation R_ARM_JUMP24
| /tmp/go-link-3088828398/go.o:go.go:function local.internal/bytealg.Count: error: unexpected opcode while processing relocation R_ARM_JUMP24
| /tmp/go-link-3088828398/go.o:go.go:function local.internal/bytealg.CountString: error: unexpected opcode while processing relocation R_ARM_JUMP24
| /tmp/go-link-3088828398/go.o:go.go:function local.runtime.memequal: error: unexpected opcode while processing relocation R_ARM_JUMP24
| /tmp/go-link-3088828398/go.o:go.go:function local.runtime.memequal_varlen: error: unexpected opcode while processing relocation R_ARM_JUMP24
| /tmp/go-link-3088828398/go.o:go.go:function local.internal/bytealg.IndexByte: error: unexpected opcode while processing relocation R_ARM_JUMP24
| /tmp/go-link-3088828398/go.o:go.go:function local.internal/bytealg.IndexByteString: error: unexpected opcode while processing relocation R_ARM_JUMP24
| /tmp/go-link-3088828398/go.o:go.go:function local.runtime.memhash8: error: unexpected opcode while processing relocation R_ARM_CALL
| /tmp/go-link-3088828398/go.o:go.go:function local.runtime.memhash8: error: unexpected opcode while processing relocation R_ARM_CALL
| /tmp/go-link-3088828398/go.o:go.go:function local.runtime.memhash16: error: unexpected opcode while processing relocation R_ARM_CALL
| /tmp/go-link-3088828398/go.o:go.go:function local.runtime.memhash16: error: unexpected opcode while processing relocation R_ARM_CALL
| /tmp/go-link-3088828398/go.o:go.go:function local.runtime.memhash128: error: unexpected opcode while processing relocation R_ARM_CALL
| /tmp/go-link-3088828398/go.o:go.go:function local.runtime.memhash128: error: unexpected opcode while processing relocation R_ARM_CALL
| /tmp/go-link-3088828398/go.o:go.go:function local.runtime.memhash_varlen: error: unexpected opcode while processing relocation R_ARM_CALL
| /tmp/go-link-3088828398/go.o:go.go:function local.runtime.strhashFallback: error: unexpected opcode while processing relocation R_ARM_CALL
| /tmp/go-link-3088828398/go.o:go.go:function local.runtime.strhashFallback: error: unexpected opcode while processing relocation R_ARM_CALL
| collect2: error: ld returned 1 exit status
| 
| WARNING: /home/pokybuild/yocto-worker/qemuarm/build/build/tmp/work/cortexa15t2hf-neon-poky-linux-gnueabi/go-runtime/1.18.3-r0/temp/run.do_compile.2411460:168 exit 2 from &apos;CC=&quot;$CC_FOR_linux_arm&quot; GOARCH=&quot;arm&quot; GOOS=&quot;linux&quot; GOROOT=/home/pokybuild/yocto-worker/qemuarm/build/build/tmp/work/cortexa15t2hf-neon-poky-linux-gnueabi/go-runtime/1.18.3-r0/go $GOTOOLDIR/go_bootstrap install -linkshared -buildmode=shared -ldflags=&quot;--linkmode=external -extldflags &apos; -mthumb -mfpu=neon -mfloat-abi=hard -mcpu=cortex-a15 -fstack-protector-strong  -O2 -D_FORTIFY_SOURCE=2 -Wformat -Wformat-security -Werror=format-security --sysroot=/home/pokybuild/yocto-worker/qemuarm/build/build/tmp/work/cortexa15t2hf-neon-poky-linux-gnueabi/go-runtime/1.18.3-r0/recipe-sysroot -Wl,-O1 -Wl,--hash-style=gnu -Wl,--as-needed                      -fdebug-prefix-map=/home/pokybuild/yocto-worker/qemuarm/build/build/tmp/work/cortexa15t2hf-neon-poky-linux-gnueabi/go-runtime/1.18.3-r0/recipe-sysroot=                      -fdebug-prefix-map=/home/pokybuild/yocto-worker/qemuarm/build/build/tmp/work/cortexa15t2hf-neon-poky-linux-gnueabi/go-runtime/1.18.3-r0/recipe-sysroot-native=  -Wl,-z,relro,-z,now&apos;&quot; std&apos;
| WARNING: Backtrace (BB generated script):
| 	#1: do_compile, /home/pokybuild/yocto-worker/qemuarm/build/build/tmp/work/cortexa15t2hf-neon-poky-linux-gnueabi/go-runtime/1.18.3-r0/temp/run.do_compile.2411460, line 168
| 	#2: main, /home/pokybuild/yocto-worker/qemuarm/build/build/tmp/work/cortexa15t2hf-neon-poky-linux-gnueabi/go-runtime/1.18.3-r0/temp/run.do_compile.2411460, line 175
NOTE: recipe go-runtime-1.18.3-r0: task do_compile: Failed


https://autobuilder.yoctoproject.org/typhoon/#/builders/53/builds/5487/steps/11/logs/stdio
qemuarm fedora36-ty-3</thetext>
  </long_desc><long_desc isprivate="0" >
    <commentid>94349</commentid>
    <comment_count>1</comment_count>
    <who name="Randy MacLeod">randy.macleod</who>
    <bug_when>2022-11-03 14:53:48 +0000</bug_when>
    <thetext>Re-open if seen again. -- YP bug review</thetext>
  </long_desc>
      
      

    </bug>

</bugzilla>