<?xml version="1.0" encoding="UTF-8" standalone="yes" ?>
<!DOCTYPE bugzilla SYSTEM "https://bugzilla.yoctoproject.org/page.cgi?id=bugzilla.dtd">

<bugzilla version="5.0.6"
          urlbase="https://bugzilla.yoctoproject.org/"
          
          maintainer="it-coreprojects-helpdesk@linuxfoundation.org"
>

    <bug>
          <bug_id>14932</bug_id>
          
          <creation_ts>2022-10-14 13:36:54 +0000</creation_ts>
          <short_desc>AB-INT: buildoptions.ImageOptionsTests.test_ccache_tool failure (pseudo abort)</short_desc>
          <delta_ts>2023-01-21 07:42:58 +0000</delta_ts>
          <reporter_accessible>1</reporter_accessible>
          <cclist_accessible>1</cclist_accessible>
          <classification_id>10</classification_id>
          <classification>QA/Testing</classification>
          <product>Functional (self) Testing</product>
          <component>oe-selftest</component>
          <version>unspecified</version>
          <rep_platform>x86</rep_platform>
          <op_sys>Multiple</op_sys>
          <bug_status>RESOLVED</bug_status>
          <resolution>FIXED</resolution>
          
          
          <bug_file_loc></bug_file_loc>
          <status_whiteboard>AB-INT</status_whiteboard>
          <keywords></keywords>
          <priority>Medium</priority>
          <bug_severity>normal</bug_severity>
          <target_milestone>4.2</target_milestone>
          
          
          <everconfirmed>1</everconfirmed>
          <reporter name="Alexandre Belloni">alexandre.belloni</reporter>
          <assigned_to name="Richard Purdie">richard.purdie</assigned_to>
          <cc>alexandre.belloni</cc>
    
    <cc>luca.ceresoli</cc>
    
    <cc>randy.macleod</cc>
    
    <cc>richard.purdie</cc>
          
          
          <cf_os>---</cf_os>
          <cf_regression_type>---</cf_regression_type>
          
          <cf_docchange>No (bug/feature does not impact docs)</cf_docchange>

      

      

      

          <comment_sort_order>oldest_to_newest</comment_sort_order>  
          <long_desc isprivate="0" >
    <commentid>94162</commentid>
    <comment_count>0</comment_count>
    <who name="Alexandre Belloni">alexandre.belloni</who>
    <bug_when>2022-10-14 13:36:54 +0000</bug_when>
    <thetext>2022-09-18 01:15:50,817 - oe-selftest - INFO - buildoptions.ImageOptionsTests.test_ccache_tool (subunit.RemotedTestCase)
2022-09-18 01:15:50,817 - oe-selftest - INFO -  ... FAIL
2022-09-18 01:15:50,817 - oe-selftest - INFO - 7: 1/11 143/503 (483.42s) (buildoptions.ImageOptionsTests.test_ccache_tool)
2022-09-18 01:15:50,818 - oe-selftest - INFO - testtools.testresult.real._StringException: Traceback (most recent call last):
  File &quot;/home/pokybuild/yocto-worker/oe-selftest-centos/build/meta/lib/oeqa/selftest/cases/buildoptions.py&quot;, line 46, in test_ccache_tool
    bitbake(&quot;%s -f -c compile&quot; % recipe)
  File &quot;/home/pokybuild/yocto-worker/oe-selftest-centos/build/meta/lib/oeqa/utils/commands.py&quot;, line 236, in bitbake
    return runCmd(cmd, ignore_status, timeout, output_log=output_log, **options)
  File &quot;/home/pokybuild/yocto-worker/oe-selftest-centos/build/meta/lib/oeqa/utils/commands.py&quot;, line 214, in runCmd
    raise AssertionError(&quot;Command &apos;%s&apos; returned non-zero exit status %d:\n%s&quot; % (command, result.status, exc_output))
AssertionError: Command &apos;bitbake  libgcc-initial -f -c compile&apos; returned non-zero exit status 1:
/usr/lib64/python3.6/importlib/_bootstrap.py:219: ImportWarning: can&apos;t resolve package from __spec__ or __package__, falling back on __name__ and __path__
  return f(*args, **kwds)

| abort()ing pseudo client by server request. See https://wiki.yoctoproject.org/wiki/Pseudo_Abort for more details on this.
| Check logfile: /home/pokybuild/yocto-worker/oe-selftest-centos/build/build-st-390979/tmp/work/core2-64-poky-linux/linux-libc-headers/5.19-r0/pseudo//pseudo.log
| /bin/sh: line 1: 657872 Aborted                 (core dumped) mkdir -p /home/pokybuild/yocto-worker/oe-selftest-centos/build/build-st-390979/tmp/work/core2-64-poky-linux/linux-libc-headers/5.19-r0/image/usr
| make: *** [Makefile:1277: headers_install] Error 134
| ERROR: oe_runmake failed
| WARNING: /home/pokybuild/yocto-worker/oe-selftest-centos/build/build-st-390979/tmp/work/core2-64-poky-linux/linux-libc-headers/5.19-r0/temp/run.do_install.645110:185 exit 1 from &apos;exit 1&apos;
| WARNING: Backtrace (BB generated script):
| 	#1: bbfatal_log, /home/pokybuild/yocto-worker/oe-selftest-centos/build/build-st-390979/tmp/work/core2-64-poky-linux/linux-libc-headers/5.19-r0/temp/run.do_install.645110, line 185
| 	#2: die, /home/pokybuild/yocto-worker/oe-selftest-centos/build/build-st-390979/tmp/work/core2-64-poky-linux/linux-libc-headers/5.19-r0/temp/run.do_install.645110, line 169
| 	#3: oe_runmake, /home/pokybuild/yocto-worker/oe-selftest-centos/build/build-st-390979/tmp/work/core2-64-poky-linux/linux-libc-headers/5.19-r0/temp/run.do_install.645110, line 164
| 	#4: do_install, /home/pokybuild/yocto-worker/oe-selftest-centos/build/build-st-390979/tmp/work/core2-64-poky-linux/linux-libc-headers/5.19-r0/temp/run.do_install.645110, line 154
| 	#5: main, /home/pokybuild/yocto-worker/oe-selftest-centos/build/build-st-390979/tmp/work/core2-64-poky-linux/linux-libc-headers/5.19-r0/temp/run.do_install.645110, line 198
NOTE: recipe linux-libc-headers-5.19-r0: task do_install: Failed
ERROR: Task (/home/pokybuild/yocto-worker/oe-selftest-centos/build/meta/recipes-kernel/linux-libc-headers/linux-libc-headers_5.19.bb:do_install) failed with exit code &apos;1&apos; 
Pseudo log:
path mismatch [2 links]: ino 20987078 db &apos;NAMELESS FILE&apos; req &apos;/home/pokybuild/yocto-worker/oe-selftest-centos/build/build-st-390979/tmp/work/core2-64-poky-linux/linux-libc-headers/5.19-r0/image/usr&apos;.
Setup complete, sending SIGUSR1 to pid 645111.</thetext>
  </long_desc><long_desc isprivate="0" >
    <commentid>94301</commentid>
    <comment_count>1</comment_count>
    <who name="Alexandre Belloni">alexandre.belloni</who>
    <bug_when>2022-10-27 20:03:00 +0000</bug_when>
    <thetext>https://autobuilder.yoctoproject.org/typhoon/#/builders/79/builds/4263/steps/15/logs/stdio

oe-selftest-centos alma8-ty-1</thetext>
  </long_desc><long_desc isprivate="0" >
    <commentid>94743</commentid>
    <comment_count>2</comment_count>
    <who name="Luca Ceresoli">luca.ceresoli</who>
    <bug_when>2023-01-18 07:58:24 +0000</bug_when>
    <thetext>https://autobuilder.yoctoproject.org/typhoon/#/builders/79/builds/4263/steps/15/logs/stdio

oe-selftest-debian on debian11-ty-3</thetext>
  </long_desc><long_desc isprivate="0" >
    <commentid>94744</commentid>
    <comment_count>3</comment_count>
      <attachid>4917</attachid>
    <who name="Luca Ceresoli">luca.ceresoli</who>
    <bug_when>2023-01-18 08:26:32 +0000</bug_when>
    <thetext>Created attachment 4917
pseudo.log for oe-selftest-debian build failure 4263</thetext>
  </long_desc><long_desc isprivate="0" >
    <commentid>94784</commentid>
    <comment_count>4</comment_count>
    <who name="Richard Purdie">richard.purdie</who>
    <bug_when>2023-01-21 07:42:58 +0000</bug_when>
    <thetext>https://git.yoctoproject.org/poky/commit/?id=45c7a5e2ac700f88b24aeb0d8e69a8f8b148d073</thetext>
  </long_desc>
      
          <attachment
              isobsolete="0"
              ispatch="0"
              isprivate="0"
          >
            <attachid>4917</attachid>
            <date>2023-01-18 08:26:32 +0000</date>
            <delta_ts>2023-01-18 08:26:32 +0000</delta_ts>
            <desc>pseudo.log for oe-selftest-debian build failure 4263</desc>
            <filename>oe-selftest-debian-4263-pseudo.log</filename>
            <type>text/x-log</type>
            <size>460</size>
            <attacher name="Luca Ceresoli">luca.ceresoli</attacher>
            
              <data encoding="base64">ZGVidWdfbG9nZmlsZTogZmQgMgpwaWQgMzYzMDg5MSBbcGFyZW50IDM2MzA4OTBdLCBkb2luZyBu
ZXcgcGlkIHNldHVwIGFuZCBzZXJ2ZXIgc3RhcnQKU2V0dXAgY29tcGxldGUsIHNlbmRpbmcgU0lH
VVNSMSB0byBwaWQgMzYzMDg5MC4KcGF0aCBtaXNtYXRjaCBbMiBsaW5rc106IGlubyA0NjY2MjQ3
NiBkYiAnTkFNRUxFU1MgRklMRScgcmVxICcvaG9tZS9wb2t5YnVpbGQveW9jdG8td29ya2VyL29l
LXNlbGZ0ZXN0LWRlYmlhbi9idWlsZC9idWlsZC1zdC0zMjk1NDkzL3RtcC93b3JrL2NvcmUyLTY0
LXBva3ktbGludXgvbGludXgtbGliYy1oZWFkZXJzLzYuMS1yMC9pbWFnZS91c3InLgpkYiBjbGVh
bnVwIGZvciBzZXJ2ZXIgc2h1dGRvd24sIDIyOjI0OjMzLjEzOQptZW1vcnktdG8tZmlsZSBiYWNr
dXAgY29tcGxldGUsIDIyOjI0OjMzLjEzOS4KZGIgY2xlYW51cCBmaW5pc2hlZCwgMjI6MjQ6MzMu
MTM5Cg==
</data>

          </attachment>
      

    </bug>

</bugzilla>