<?xml version="1.0" encoding="UTF-8" standalone="yes" ?>
<!DOCTYPE bugzilla SYSTEM "https://bugzilla.yoctoproject.org/page.cgi?id=bugzilla.dtd">

<bugzilla version="5.0.6"
          urlbase="https://bugzilla.yoctoproject.org/"
          
          maintainer="it-coreprojects-helpdesk@linuxfoundation.org"
>

    <bug>
          <bug_id>14997</bug_id>
          
          <creation_ts>2023-01-03 09:42:23 +0000</creation_ts>
          <short_desc>AB-INT archiver.Archiver.test_archiver_srpm_mode failure</short_desc>
          <delta_ts>2023-01-12 16:35:24 +0000</delta_ts>
          <reporter_accessible>1</reporter_accessible>
          <cclist_accessible>1</cclist_accessible>
          <classification_id>10</classification_id>
          <classification>QA/Testing</classification>
          <product>Functional (self) Testing</product>
          <component>oe-selftest</component>
          <version>unspecified</version>
          <rep_platform>x86</rep_platform>
          <op_sys>Multiple</op_sys>
          <bug_status>RESOLVED</bug_status>
          <resolution>FIXED</resolution>
          
          
          <bug_file_loc></bug_file_loc>
          <status_whiteboard></status_whiteboard>
          <keywords></keywords>
          <priority>Medium+</priority>
          <bug_severity>normal</bug_severity>
          <target_milestone>4.2 M2</target_milestone>
          
          
          <everconfirmed>1</everconfirmed>
          <reporter name="Alexander Kanavin">alex.kanavin</reporter>
          <assigned_to name="Richard Purdie">richard.purdie</assigned_to>
          <cc>alexandre.belloni</cc>
    
    <cc>randy.macleod</cc>
          
          
          <cf_os>---</cf_os>
          <cf_regression_type>---</cf_regression_type>
          
          <cf_docchange>No (bug/feature does not impact docs)</cf_docchange>

      

      

      

          <comment_sort_order>oldest_to_newest</comment_sort_order>  
          <long_desc isprivate="0" >
    <commentid>94609</commentid>
    <comment_count>0</comment_count>
    <who name="Alexander Kanavin">alex.kanavin</who>
    <bug_when>2023-01-03 09:42:23 +0000</bug_when>
    <thetext>https://autobuilder.yoctoproject.org/typhoon/#/builders/80/builds/4563/steps/14/logs/stdio

2023-01-03 00:10:57,709 - oe-selftest - INFO - 0: 16/40 126/507 (1.67s) (0 failed) (archiver.Archiver.test_archiver_srpm_mode)
2023-01-03 00:10:57,709 - oe-selftest - INFO - testtools.testresult.real._StringException: Traceback (most recent call last):
  File &quot;/home/pokybuild/yocto-worker/oe-selftest-debian/build/meta/lib/oeqa/selftest/cases/archiver.py&quot;, line 166, in test_archiver_srpm_mode
    bitbake(&apos;-n selftest-nopackages selftest-ed&apos;)
  File &quot;/home/pokybuild/yocto-worker/oe-selftest-debian/build/meta/lib/oeqa/utils/commands.py&quot;, line 236, in bitbake
    return runCmd(cmd, ignore_status, timeout, output_log=output_log, **options)
  File &quot;/home/pokybuild/yocto-worker/oe-selftest-debian/build/meta/lib/oeqa/utils/commands.py&quot;, line 214, in runCmd
    raise AssertionError(&quot;Command &apos;%s&apos; returned non-zero exit status %d:\n%s&quot; % (command, result.status, exc_output))
AssertionError: Command &apos;bitbake  -n selftest-nopackages selftest-ed&apos; returned non-zero exit status 134:
libgcc_s.so.1 must be installed for pthread_cancel to work
Aborted</thetext>
  </long_desc><long_desc isprivate="0" >
    <commentid>94620</commentid>
    <comment_count>1</comment_count>
    <who name="Randy MacLeod">randy.macleod</who>
    <bug_when>2023-01-05 15:39:25 +0000</bug_when>
    <thetext>Add libgcc to uninative and respin that?</thetext>
  </long_desc><long_desc isprivate="0" >
    <commentid>94664</commentid>
    <comment_count>2</comment_count>
    <who name="Alexandre Belloni">alexandre.belloni</who>
    <bug_when>2023-01-11 21:06:38 +0000</bug_when>
    <thetext>https://autobuilder.yoctoproject.org/typhoon/#/builders/56/builds/2092/steps/14/logs/stdio
oe-selftest debian11-ty-2

https://autobuilder.yoctoproject.org/typhoon/#/builders/127/builds/723/steps/14/logs/stdio
oe-selftest-armhost ubuntu2204-arm-1</thetext>
  </long_desc><long_desc isprivate="0" >
    <commentid>94668</commentid>
    <comment_count>3</comment_count>
    <who name="Alexandre Belloni">alexandre.belloni</who>
    <bug_when>2023-01-11 22:05:29 +0000</bug_when>
    <thetext>https://autobuilder.yoctoproject.org/typhoon/#builders/56/builds/2090/steps/14/logs/stdio
oe-selftest fedora36-ty-2</thetext>
  </long_desc><long_desc isprivate="0" >
    <commentid>94671</commentid>
    <comment_count>4</comment_count>
    <who name="Alexandre Belloni">alexandre.belloni</who>
    <bug_when>2023-01-11 22:41:10 +0000</bug_when>
    <thetext>the previous 3 are actually a different issue</thetext>
  </long_desc><long_desc isprivate="0" >
    <commentid>94674</commentid>
    <comment_count>5</comment_count>
    <who name="Alexandre Belloni">alexandre.belloni</who>
    <bug_when>2023-01-11 22:47:23 +0000</bug_when>
    <thetext>https://autobuilder.yoctoproject.org/typhoon/#/builders/80/builds/4557/steps/14/logs/stdio

https://autobuilder.yoctoproject.org/typhoon/#builders/80/builds/4555/steps/14/logs/stdio</thetext>
  </long_desc><long_desc isprivate="0" >
    <commentid>94675</commentid>
    <comment_count>6</comment_count>
    <who name="Richard Purdie">richard.purdie</who>
    <bug_when>2023-01-11 22:48:05 +0000</bug_when>
    <thetext>https://git.yoctoproject.org/poky/commit/?id=4595a8bc621a5912285d26894de4fd4bd03a1bee</thetext>
  </long_desc>
      
      

    </bug>

</bugzilla>