<?xml version="1.0" encoding="UTF-8" standalone="yes" ?>
<!DOCTYPE bugzilla SYSTEM "https://bugzilla.yoctoproject.org/page.cgi?id=bugzilla.dtd">

<bugzilla version="5.0.6"
          urlbase="https://bugzilla.yoctoproject.org/"
          
          maintainer="it-coreprojects-helpdesk@linuxfoundation.org"
>

    <bug>
          <bug_id>15005</bug_id>
          
          <creation_ts>2023-01-12 15:35:10 +0000</creation_ts>
          <short_desc>ParseError in None: Not all recipes parsed, parser thread killed/died? Exiting.</short_desc>
          <delta_ts>2024-12-24 23:34:17 +0000</delta_ts>
          <reporter_accessible>1</reporter_accessible>
          <cclist_accessible>1</cclist_accessible>
          <classification_id>7</classification_id>
          <classification>Build System, Metadata &amp; Runtime</classification>
          <product>BitBake</product>
          <component>bitbake</component>
          <version>unspecified</version>
          <rep_platform>x86</rep_platform>
          <op_sys>Multiple</op_sys>
          <bug_status>RESOLVED</bug_status>
          <resolution>FIXED</resolution>
          
          
          <bug_file_loc></bug_file_loc>
          <status_whiteboard>AB-INT</status_whiteboard>
          <keywords></keywords>
          <priority>Medium+</priority>
          <bug_severity>normal</bug_severity>
          <target_milestone>5.0 M1</target_milestone>
          
          
          <everconfirmed>1</everconfirmed>
          <reporter name="Alexandre Belloni">alexandre.belloni</reporter>
          <assigned_to name="Richard Purdie">richard.purdie</assigned_to>
          <cc>alexandre.belloni</cc>
    
    <cc>floss</cc>
    
    <cc>JPEWhacker</cc>
    
    <cc>luca.ceresoli</cc>
    
    <cc>poky.bs.watcher</cc>
    
    <cc>poky.watcher</cc>
    
    <cc>randy.macleod</cc>
    
    <cc>steve</cc>
    
    <cc>william.lyu</cc>
          
          
          <cf_os>---</cf_os>
          <cf_regression_type>---</cf_regression_type>
          
          <cf_docchange>No (bug/feature does not impact docs)</cf_docchange>

      

      

      

          <comment_sort_order>oldest_to_newest</comment_sort_order>  
          <long_desc isprivate="0" >
    <commentid>94693</commentid>
    <comment_count>0</comment_count>
    <who name="Alexandre Belloni">alexandre.belloni</who>
    <bug_when>2023-01-12 15:35:10 +0000</bug_when>
    <thetext>2022-12-29 14:15:47,695 - oe-selftest - INFO - FAIL: sysroot.SysrootTests.test_sysroot_cleanup (subunit.RemotedTestCase)
2022-12-29 14:15:47,695 - oe-selftest - INFO - ----------------------------------------------------------------------
2022-12-29 14:15:47,695 - oe-selftest - INFO - testtools.testresult.real._StringException: Traceback (most recent call last):
  File &quot;/home/pokybuild/yocto-worker/oe-selftest-debian/build/meta/lib/oeqa/selftest/cases/sysroot.py&quot;, line 32, in test_sysroot_cleanup
    bitbake(&quot;sysroot-test&quot;)
  File &quot;/home/pokybuild/yocto-worker/oe-selftest-debian/build/meta/lib/oeqa/utils/commands.py&quot;, line 236, in bitbake
    return runCmd(cmd, ignore_status, timeout, output_log=output_log, **options)
  File &quot;/home/pokybuild/yocto-worker/oe-selftest-debian/build/meta/lib/oeqa/utils/commands.py&quot;, line 214, in runCmd
    raise AssertionError(&quot;Command &apos;%s&apos; returned non-zero exit status %d:\n%s&quot; % (command, result.status, exc_output))
AssertionError: Command &apos;bitbake  sysroot-test&apos; returned non-zero exit status 1:
NOTE: Reconnecting to bitbake server...
Loading cache...done.
Loaded 0 entries from dependency cache.
Parsing recipes...ERROR: ParseError in None: Not all recipes parsed, parser thread killed/died? Exiting.
ERROR: Parsing halted due to errors, see error messages above</thetext>
  </long_desc><long_desc isprivate="0" >
    <commentid>94694</commentid>
    <comment_count>1</comment_count>
    <who name="Alexandre Belloni">alexandre.belloni</who>
    <bug_when>2023-01-12 15:35:40 +0000</bug_when>
    <thetext>https://autobuilder.yoctoproject.org/typhoon/#builders/80/builds/4545/steps/14/logs/stdio
oe-selftest-debian debian11-ty-2</thetext>
  </long_desc><long_desc isprivate="0" >
    <commentid>94699</commentid>
    <comment_count>2</comment_count>
    <who name="Randy MacLeod">randy.macleod</who>
    <bug_when>2023-01-12 15:44:25 +0000</bug_when>
    <thetext>May have been fixed by patch on Jan 11.</thetext>
  </long_desc><long_desc isprivate="0" >
    <commentid>94700</commentid>
    <comment_count>3</comment_count>
    <who name="Richard Purdie">richard.purdie</who>
    <bug_when>2023-01-12 15:44:39 +0000</bug_when>
    <thetext>May be fixed by https://git.yoctoproject.org/poky/commit/?id=51f732114168d5a689f7baceae74bd68ff6e5745 ?</thetext>
  </long_desc><long_desc isprivate="0" >
    <commentid>94885</commentid>
    <comment_count>4</comment_count>
    <who name="Alexandre Belloni">alexandre.belloni</who>
    <bug_when>2023-02-03 21:50:32 +0000</bug_when>
    <thetext>https://autobuilder.yoctoproject.org/typhoon/#/builders/87/builds/4767/steps/14/logs/stdio

2023-01-29 21:33:23,461 - oe-selftest - INFO - prservice.BitbakePrTests.test_import_export_override_db (subunit.RemotedTestCase)
2023-01-29 21:33:23,462 - oe-selftest - INFO -  ... FAIL
2023-01-29 21:33:23,462 - oe-selftest - INFO - 10: 11/23 232/510 (4667.61s) (0 failed) (prservice.BitbakePrTests.test_import_export_override_db)
2023-01-29 21:33:23,462 - oe-selftest - INFO - testtools.testresult.real._StringException: Traceback (most recent call last):
  File &quot;/home/pokybuild/yocto-worker/oe-selftest-ubuntu/build/meta/lib/oeqa/selftest/cases/prservice.py&quot;, line 100, in test_import_export_override_db
    self.run_test_pr_export_import(&apos;m4&apos;, replace_current_db=False)
  File &quot;/home/pokybuild/yocto-worker/oe-selftest-ubuntu/build/meta/lib/oeqa/selftest/cases/prservice.py&quot;, line 89, in run_test_pr_export_import
    self.assertEqual(import_result.status, 0, msg=&quot;PR Service database import failed: %s&quot; % import_result.output)
  File &quot;/usr/lib/python3.8/unittest/case.py&quot;, line 912, in assertEqual
    assertion_func(first, second, msg=msg)
  File &quot;/usr/lib/python3.8/unittest/case.py&quot;, line 905, in _baseAssertEqual
    raise self.failureException(msg)
AssertionError: 1 != 0 : PR Service database import failed: NOTE: Terminated bitbake server.
NOTE: Started PRServer with DBfile: /home/pokybuild/yocto-worker/oe-selftest-ubuntu/build/build-st-1389717/cache/prserv.sqlite3, Address: 127.0.0.1:36735, PID: 893940
Loading cache...done.
Loaded 0 entries from dependency cache.
Parsing recipes...ERROR: ParseError in None: Not all recipes parsed, parser thread killed/died? Exiting.
ERROR: Parsing halted due to errors, see error messages above</thetext>
  </long_desc><long_desc isprivate="0" >
    <commentid>94890</commentid>
    <comment_count>5</comment_count>
    <who name="Richard Purdie">richard.purdie</who>
    <bug_when>2023-02-05 14:43:46 +0000</bug_when>
    <thetext>This occurred again, ubuntu2004-ty-1 again:

https://autobuilder.yoctoproject.org/typhoon/#/builders/87/builds/4796/steps/14/logs/stdio

in prserver tests. What was interesting is I could see the bitbake-cookerdaemon.log for this one which has:

$ cat bitbake-cookerdaemon.log | grep ld.so -C 10
2770009 01:12:30.225787 Running command [&apos;getVariable&apos;, &apos;BB_DEFAULT_TASK&apos;]
2770009 01:12:30.226056 Command Completed (socket: True)
2770009 01:12:30.226183 Running command [&apos;setConfig&apos;, &apos;cmd&apos;, &apos;build&apos;]
2770009 01:12:30.226422 Command Completed (socket: True)
2770009 01:12:30.226540 Running command [&apos;getVariable&apos;, &apos;BBTARGETS&apos;]
2770009 01:12:30.226782 Command Completed (socket: True)
2770009 01:12:30.226922 Running command [&apos;parseFiles&apos;]
2770009 01:12:30.227045 Registering idle function &lt;bound method Command.runAsyncCommand of &lt;bb.command.Command object at 0x7fd33ad6b970&gt;&gt; (1 handlers)
2770009 01:12:30.227133 Command Completed (socket: True)
2770009 01:12:30.354229 Parsing started
Inconsistency detected by ld.so: dl-open.c: 560: dl_open_worker: Assertion `_dl_debug_initialize (0, args-&gt;nsid)-&gt;r_state == RT_CONSISTENT&apos; failed!
/usr/lib/python3.8/asyncio/base_events.py:654: ResourceWarning: unclosed event loop &lt;_UnixSelectorEventLoop running=False closed=False debug=False&gt;
  _warn(f&quot;unclosed event loop {self!r}&quot;, ResourceWarning, source=self)
ResourceWarning: Enable tracemalloc to get the object allocation traceback
/usr/lib/python3.8/asyncio/selector_events.py:696: ResourceWarning: unclosed transport &lt;_SelectorSocketTransport fd=15&gt;
  _warn(f&quot;unclosed transport {self!r}&quot;, ResourceWarning, source=self)
ResourceWarning: Enable tracemalloc to get the object allocation traceback
/usr/lib/python3.8/asyncio/base_events.py:654: ResourceWarning: unclosed event loop &lt;_UnixSelectorEventLoop running=False closed=False debug=False&gt;
  _warn(f&quot;unclosed event loop {self!r}&quot;, ResourceWarning, source=self)
ResourceWarning: Enable tracemalloc to get the object allocation traceback
/usr/lib/python3.8/asyncio/selector_events.py:696: ResourceWarning: unclosed transport &lt;_SelectorSocketTransport fd=15&gt;
pokybuild@ubuntu2004-ty-1:~/saved/build/build-st-1417193$ cat bitbake-cookerdaemon.log | grep ld.so -C 30
2770009 01:12:29.284563 Accepting [&lt;socket.socket fd=6, family=AddressFamily.AF_UNIX, type=SocketKind.SOCK_STREAM, proto=0, laddr=bitbake.sock&gt;] ([])
2770009 01:12:29.284653 Processing Client
2770009 01:12:29.284708 Connecting Client
2770009 01:12:29.285151 Running command [&apos;setFeatures&apos;, [2, 1]]
2770009 01:12:29.285902 Command Completed (socket: True)
2770009 01:12:29.286055 Running command [&apos;updateConfig&apos;, {&apos;halt&apos;: True, &apos;force&apos;: False, &apos;invalidate_stamp&apos;: None, &apos;dry_run&apos;: False, &apos;dump_signatures&apos;: [], &apos;extra_assume_provided&apos;: [], &apos;profile&apos;: False, &apos;prefile&apos;: [], &apos;postfile&apos;: [&apos;conf/primport.conf&apos;, &apos;/home/pokybuild/yocto-worker/oe-selftest-ubuntu/build/build-st-1417193/export.inc&apos;], &apos;server_timeout&apos;: None, &apos;nosetscene&apos;: False, &apos;setsceneonly&apos;: False, &apos;skipsetscene&apos;: False, &apos;runall&apos;: [], &apos;runonly&apos;: None, &apos;writeeventlog&apos;: None, &apos;build_verbose_shell&apos;: False, &apos;build_verbose_stdout&apos;: False, &apos;default_loglevel&apos;: 20, &apos;debug_domains&apos;: {}}, {&apos;SHELL&apos;: &apos;/bin/bash&apos;, &apos;BB_ENV_PASSTHROUGH_ADDITIONS&apos;: &apos;ALL_PROXY BBPATH_EXTRA BB_LOGCONFIG BB_NO_NETWORK BB_NUMBER_THREADS BB_SETSCENE_ENFORCE BB_SRCREV_POLICY DISTRO FTPS_PROXY FTP_PROXY GIT_PROXY_COMMAND HTTPS_PROXY HTTP_PROXY MACHINE NO_PROXY PARALLEL_MAKE SCREENDIR SDKMACHINE SOCKS5_PASSWD SOCKS5_USER SSH_AGENT_PID SSH_AUTH_SOCK STAMPS_DIR TCLIBC TCMODE all_proxy ftp_proxy ftps_proxy http_proxy https_proxy no_proxy &apos;, &apos;BB_LOGCONFIG&apos;: &apos;/home/pokybuild/yocto-worker/oe-selftest-ubuntu/build/build-st-1417193/../bitbake/contrib/autobuilderlog.json&apos;, &apos;PWD&apos;: &apos;/home/pokybuild/yocto-worker/oe-selftest-ubuntu/build/build-st-1417193&apos;, &apos;LOGNAME&apos;: &apos;pokybuild&apos;, &apos;HOME&apos;: &apos;/home/pokybuild&apos;, &apos;BBPATH&apos;: &apos;/home/pokybuild/yocto-worker/oe-selftest-ubuntu/build/build-st-1417193&apos;, &apos;USER&apos;: &apos;pokybuild&apos;, &apos;PATH&apos;: &apos;/home/pokybuild/yocto-worker/oe-selftest-ubuntu/build/scripts:/home/pokybuild/yocto-worker/oe-selftest-ubuntu/build/bitbake/bin:/usr/local/sbin:/usr/local/bin:/usr/sbin:/usr/bin:/sbin:/bin:/snap/bin&apos;, &apos;LC_ALL&apos;: &apos;en_US.UTF-8&apos;, &apos;ABHELPER_JSON&apos;: &apos;config.json /home/pokybuild/config-local.json&apos;, &apos;LANG&apos;: &apos;en_US.UTF-8&apos;, &apos;INVOCATION_ID&apos;: &apos;8f2cbc607c9141729fa2996fd6abc6f3&apos;, &apos;OEQA_DEBUGGING_SAVED_OUTPUT&apos;: &apos;/srv/autobuilder/autobuilder.yocto.io/pub/repro-fail/&apos;, &apos;PYTHONPATH&apos;: &apos;/home/pokybuild/yocto-worker/oe-selftest-ubuntu/build/bitbake/lib:&apos;, &apos;SCRIPTSDIR&apos;: &apos;/home/pokybuild/yocto-worker/oe-selftest-ubuntu/yocto-autobuilder-helper/scripts&apos;, &apos;DISPLAY&apos;: &apos;:1&apos;, &apos;SHLVL&apos;: &apos;1&apos;, &apos;JOURNAL_STREAM&apos;: &apos;9:32262&apos;, &apos;BUILDDIR&apos;: &apos;/home/pokybuild/yocto-worker/oe-selftest-ubuntu/build/build-st-1417193&apos;, &apos;OLDPWD&apos;: &apos;/home/pokybuild/yocto-worker/oe-selftest-ubuntu/build&apos;, &apos;_&apos;: &apos;/home/pokybuild/yocto-worker/oe-selftest-ubuntu/build/bitbake/bin/bitbake&apos;}, [&apos;/home/pokybuild/yocto-worker/oe-selftest-ubuntu/build/bitbake/bin/bitbake&apos;, &apos;-R&apos;, &apos;conf/primport.conf&apos;, &apos;-R&apos;, &apos;/home/pokybuild/yocto-worker/oe-selftest-ubuntu/build/build-st-1417193/export.inc&apos;, &apos;-p&apos;]]
Marking as dirty due to &apos;postfile&apos; option change to &apos;[&apos;conf/primport.conf&apos;, &apos;/home/pokybuild/yocto-worker/oe-selftest-ubuntu/build/build-st-1417193/export.inc&apos;]&apos;
2770009 01:12:30.216211 Command Completed (socket: True)
2770009 01:12:30.216516 Running command [&apos;getVariable&apos;, &apos;BBINCLUDELOGS&apos;]
2770009 01:12:30.217174 Command Completed (socket: True)
2770009 01:12:30.219200 Running command [&apos;getVariable&apos;, &apos;BBINCLUDELOGS_LINES&apos;]
2770009 01:12:30.219621 Command Completed (socket: True)
2770009 01:12:30.219829 Running command [&apos;getSetVariable&apos;, &apos;BB_CONSOLELOG&apos;]
2770009 01:12:30.220313 Command Completed (socket: True)
2770009 01:12:30.220442 Running command [&apos;getSetVariable&apos;, &apos;BB_LOGCONFIG&apos;]
2770009 01:12:30.220725 Command Completed (socket: True)
2770009 01:12:30.224693 Running command [&apos;getUIHandlerNum&apos;]
2770009 01:12:30.225155 Command Completed (socket: True)
2770009 01:12:30.225368 Running command [&apos;setEventMask&apos;, 1, 20, {&apos;BitBake.SigGen.HashEquiv&apos;: 19, &apos;BitBake.RunQueue.HashEquiv&apos;: 19}, [&apos;bb.runqueue.runQueueExitWait&apos;, &apos;bb.event.LogExecTTY&apos;, &apos;logging.LogRecord&apos;, &apos;bb.build.TaskFailed&apos;, &apos;bb.build.TaskBase&apos;, &apos;bb.event.ParseStarted&apos;, &apos;bb.event.ParseProgress&apos;, &apos;bb.event.ParseCompleted&apos;, &apos;bb.event.CacheLoadStarted&apos;, &apos;bb.event.CacheLoadProgress&apos;, &apos;bb.event.CacheLoadCompleted&apos;, &apos;bb.command.CommandFailed&apos;, &apos;bb.command.CommandExit&apos;, &apos;bb.command.CommandCompleted&apos;, &apos;bb.cooker.CookerExit&apos;, &apos;bb.event.MultipleProviders&apos;, &apos;bb.event.NoProvider&apos;, &apos;bb.runqueue.sceneQueueTaskStarted&apos;, &apos;bb.runqueue.runQueueTaskStarted&apos;, &apos;bb.runqueue.runQueueTaskFailed&apos;, &apos;bb.runqueue.sceneQueueTaskFailed&apos;, &apos;bb.event.BuildBase&apos;, &apos;bb.build.TaskStarted&apos;, &apos;bb.build.TaskSucceeded&apos;, &apos;bb.build.TaskFailedSilent&apos;, &apos;bb.build.TaskProgress&apos;, &apos;bb.event.ProcessStarted&apos;, &apos;bb.event.ProcessProgress&apos;, &apos;bb.event.ProcessFinished&apos;]]
2770009 01:12:30.225654 Command Completed (socket: True)
2770009 01:12:30.225787 Running command [&apos;getVariable&apos;, &apos;BB_DEFAULT_TASK&apos;]
2770009 01:12:30.226056 Command Completed (socket: True)
2770009 01:12:30.226183 Running command [&apos;setConfig&apos;, &apos;cmd&apos;, &apos;build&apos;]
2770009 01:12:30.226422 Command Completed (socket: True)
2770009 01:12:30.226540 Running command [&apos;getVariable&apos;, &apos;BBTARGETS&apos;]
2770009 01:12:30.226782 Command Completed (socket: True)
2770009 01:12:30.226922 Running command [&apos;parseFiles&apos;]
2770009 01:12:30.227045 Registering idle function &lt;bound method Command.runAsyncCommand of &lt;bb.command.Command object at 0x7fd33ad6b970&gt;&gt; (1 handlers)
2770009 01:12:30.227133 Command Completed (socket: True)
2770009 01:12:30.354229 Parsing started
Inconsistency detected by ld.so: dl-open.c: 560: dl_open_worker: Assertion `_dl_debug_initialize (0, args-&gt;nsid)-&gt;r_state == RT_CONSISTENT&apos; failed!
/usr/lib/python3.8/asyncio/base_events.py:654: ResourceWarning: unclosed event loop &lt;_UnixSelectorEventLoop running=False closed=False debug=False&gt;
  _warn(f&quot;unclosed event loop {self!r}&quot;, ResourceWarning, source=self)
ResourceWarning: Enable tracemalloc to get the object allocation traceback
/usr/lib/python3.8/asyncio/selector_events.py:696: ResourceWarning: unclosed transport &lt;_SelectorSocketTransport fd=15&gt;
  _warn(f&quot;unclosed transport {self!r}&quot;, ResourceWarning, source=self)
ResourceWarning: Enable tracemalloc to get the object allocation traceback
/usr/lib/python3.8/asyncio/base_events.py:654: ResourceWarning: unclosed event loop &lt;_UnixSelectorEventLoop running=False closed=False debug=False&gt;
  _warn(f&quot;unclosed event loop {self!r}&quot;, ResourceWarning, source=self)
ResourceWarning: Enable tracemalloc to get the object allocation traceback
/usr/lib/python3.8/asyncio/selector_events.py:696: ResourceWarning: unclosed transport &lt;_SelectorSocketTransport fd=15&gt;
  _warn(f&quot;unclosed transport {self!r}&quot;, ResourceWarning, source=self)
ResourceWarning: Enable tracemalloc to get the object allocation traceback
/usr/lib/python3.8/asyncio/base_events.py:654: ResourceWarning: unclosed event loop &lt;_UnixSelectorEventLoop running=False closed=False debug=False&gt;
  _warn(f&quot;unclosed event loop {self!r}&quot;, ResourceWarning, source=self)
ResourceWarning: Enable tracemalloc to get the object allocation traceback
/usr/lib/python3.8/asyncio/selector_events.py:696: ResourceWarning: unclosed transport &lt;_SelectorSocketTransport fd=15&gt;
  _warn(f&quot;unclosed transport {self!r}&quot;, ResourceWarning, source=self)
ResourceWarning: Enable tracemalloc to get the object allocation traceback
/usr/lib/python3.8/asyncio/base_events.py:654: ResourceWarning: unclosed event loop &lt;_UnixSelectorEventLoop running=False closed=False debug=False&gt;
  _warn(f&quot;unclosed event loop {self!r}&quot;, ResourceWarning, source=self)
ResourceWarning: Enable tracemalloc to get the object allocation traceback
/usr/lib/python3.8/asyncio/selector_events.py:696: ResourceWarning: unclosed transport &lt;_SelectorSocketTransport fd=15&gt;
  _warn(f&quot;unclosed transport {self!r}&quot;, ResourceWarning, source=self)
ResourceWarning: Enable tracemalloc to get the object allocation traceback
/usr/lib/python3.8/asyncio/base_events.py:654: ResourceWarning: unclosed event loop &lt;_UnixSelectorEventLoop running=False closed=False debug=False&gt;
  _warn(f&quot;unclosed event loop {self!r}&quot;, ResourceWarning, source=self)
ResourceWarning: Enable tracemalloc to get the object allocation traceback
/usr/lib/python3.8/asyncio/selector_events.py:696: ResourceWarning: unclosed transport &lt;_SelectorSocketTransport fd=15&gt;
  _warn(f&quot;unclosed transport {self!r}&quot;, ResourceWarning, source=self)
ResourceWarning: Enable tracemalloc to get the object allocation traceback


i.e.

Inconsistency detected by ld.so: dl-open.c: 560: dl_open_worker: Assertion `_dl_debug_initialize (0, args-&gt;nsid)-&gt;r_state == RT_CONSISTENT&apos; failed!</thetext>
  </long_desc><long_desc isprivate="0" >
    <commentid>94892</commentid>
    <comment_count>6</comment_count>
    <who name="Richard Purdie">richard.purdie</who>
    <bug_when>2023-02-06 08:50:16 +0000</bug_when>
    <thetext>and again on ubuntu2004-arm-1:

https://autobuilder.yoctoproject.org/typhoon/#/builders/127/builds/914

which also had the ld.so message in bitbake-cookerdaemon.log:

Inconsistency detected by ld.so: dl-open.c: 560: dl_open_worker: Assertion `_dl_debug_initialize (0, args-&gt;nsid)-&gt;r_state == RT_CONSISTENT&apos; failed!</thetext>
  </long_desc><long_desc isprivate="0" >
    <commentid>94893</commentid>
    <comment_count>7</comment_count>
    <who name="Richard Purdie">richard.purdie</who>
    <bug_when>2023-02-06 11:03:26 +0000</bug_when>
    <thetext>https://sourceware.org/bugzilla/show_bug.cgi?id=22380 kind of related?</thetext>
  </long_desc><long_desc isprivate="0" >
    <commentid>94903</commentid>
    <comment_count>8</comment_count>
    <who name="Luca Ceresoli">luca.ceresoli</who>
    <bug_when>2023-02-07 22:09:34 +0000</bug_when>
    <thetext>https://autobuilder.yoctoproject.org/typhoon/#/builders/80/builds/4720/steps/14/logs/stdio

oe-selftest-debian on debian11-ty-3

and

https://autobuilder.yoctoproject.org/typhoon/#/builders/127/builds/922/steps/14/logs/stdio

oe-selftest-armhost on ubuntu2004-arm-1</thetext>
  </long_desc><long_desc isprivate="0" >
    <commentid>94904</commentid>
    <comment_count>9</comment_count>
    <who name="Luca Ceresoli">luca.ceresoli</who>
    <bug_when>2023-02-08 08:56:40 +0000</bug_when>
    <thetext>https://autobuilder.yoctoproject.org/typhoon/#/builders/127/builds/925/steps/14/logs/stdio

oe-selftest-armhost on ubuntu2004-arm-1</thetext>
  </long_desc><long_desc isprivate="0" >
    <commentid>94924</commentid>
    <comment_count>10</comment_count>
    <who name="Luca Ceresoli">luca.ceresoli</who>
    <bug_when>2023-02-10 21:11:23 +0000</bug_when>
    <thetext>https://autobuilder.yoctoproject.org/typhoon/#/builders/80/builds/4740/steps/14/logs/stdio

oe-selftest-debian on debian11-ty-2</thetext>
  </long_desc><long_desc isprivate="0" >
    <commentid>95160</commentid>
    <comment_count>11</comment_count>
    <who name="Alexandre Belloni">alexandre.belloni</who>
    <bug_when>2023-03-16 21:36:06 +0000</bug_when>
    <thetext>https://autobuilder.yoctoproject.org/typhoon/#/builders/127/builds/1118/steps/14/logs/stdio

oe-selftest-armhost ubuntu2004-arm-1</thetext>
  </long_desc><long_desc isprivate="0" >
    <commentid>95193</commentid>
    <comment_count>12</comment_count>
    <who name="Alexandre Belloni">alexandre.belloni</who>
    <bug_when>2023-03-23 15:27:51 +0000</bug_when>
    <thetext>https://autobuilder.yoctoproject.org/typhoon/#/builders/127/builds/1127/steps/14/logs/stdio

oe-selftest-armhost ubuntu2004-arm-1</thetext>
  </long_desc><long_desc isprivate="0" >
    <commentid>95201</commentid>
    <comment_count>13</comment_count>
    <who name="Alexandre Belloni">alexandre.belloni</who>
    <bug_when>2023-03-27 15:40:14 +0000</bug_when>
    <thetext>https://autobuilder.yoctoproject.org/typhoon/#/builders/87/builds/5013/steps/14/logs/stdio

oe-selftest-ubuntu ubuntu2004-ty-1

https://autobuilder.yoctoproject.org/typhoon/#/builders/80/builds/4933/steps/14/logs/stdio

oe-selftest-debian debian11-ty-3

https://autobuilder.yoctoproject.org/typhoon/#/builders/87/builds/5015/steps/14/logs/stdio

oe-selftest-ubuntu ubuntu2004-ty-1</thetext>
  </long_desc><long_desc isprivate="0" >
    <commentid>95218</commentid>
    <comment_count>14</comment_count>
    <who name="Alexandre Belloni">alexandre.belloni</who>
    <bug_when>2023-03-30 14:08:03 +0000</bug_when>
    <thetext>https://autobuilder.yoctoproject.org/typhoon/#/builders/127/builds/1177/steps/14/logs/stdio

oe-selftest-armhost ubuntu2004-arm-1

https://autobuilder.yoctoproject.org/typhoon/#/builders/127/builds/1157/steps/14/logs/stdio

oe-selftest-armhost ubuntu2004-arm-1</thetext>
  </long_desc><long_desc isprivate="0" >
    <commentid>95220</commentid>
    <comment_count>15</comment_count>
    <who name="Alexandre Belloni">alexandre.belloni</who>
    <bug_when>2023-03-30 14:17:35 +0000</bug_when>
    <thetext>https://autobuilder.yoctoproject.org/typhoon/#/builders/87/builds/5028/steps/14/logs/stdio

oe-selftest-ubuntu ubuntu2004-ty-1</thetext>
  </long_desc><long_desc isprivate="0" >
    <commentid>95237</commentid>
    <comment_count>16</comment_count>
    <who name="Joshua Watt">JPEWhacker</who>
    <bug_when>2023-03-30 15:10:57 +0000</bug_when>
    <thetext>This might be related to calling dlopen() calls from python inside forked processes. Potentially, something like python thinking there are threads inside the forked process and trying to clean them up, e.g. looking for pthread_cancel() in libgcc

It seems possible this is a race between when threads are created, and when processes are forked off. One way to try an track it down would be to track when threads are created in bitbake, and then log which threads are running when processes are forked off of bitbake to try and see any patterns.</thetext>
  </long_desc><long_desc isprivate="0" >
    <commentid>95271</commentid>
    <comment_count>17</comment_count>
    <who name="Steve Sakoman">steve</who>
    <bug_when>2023-04-02 16:39:56 +0000</bug_when>
    <thetext>Kirkstone occurrence:

https://autobuilder.yoctoproject.org/typhoon/#/builders/127/builds/1214/steps/14/logs/stdio

oe-selftest-armhost ubuntu2004-arm-1</thetext>
  </long_desc><long_desc isprivate="0" >
    <commentid>95302</commentid>
    <comment_count>18</comment_count>
    <who name="Alexandre Belloni">alexandre.belloni</who>
    <bug_when>2023-04-06 13:14:39 +0000</bug_when>
    <thetext>https://autobuilder.yoctoproject.org/typhoon/#/builders/127/builds/1211/steps/14/logs/stdio

oe-selftest-armhost ubuntu2004-arm-1</thetext>
  </long_desc><long_desc isprivate="0" >
    <commentid>95558</commentid>
    <comment_count>19</comment_count>
    <who name="Alexandre Belloni">alexandre.belloni</who>
    <bug_when>2023-05-18 19:47:53 +0000</bug_when>
    <thetext>https://autobuilder.yoctoproject.org/typhoon/#/builders/127/builds/1428/steps/14/logs/stdio

oe-selftest-armhost ubuntu2004-arm-1</thetext>
  </long_desc><long_desc isprivate="0" >
    <commentid>95562</commentid>
    <comment_count>20</comment_count>
    <who name="Alexandre Belloni">alexandre.belloni</who>
    <bug_when>2023-05-18 20:52:27 +0000</bug_when>
    <thetext>https://autobuilder.yoctoproject.org/typhoon/#/builders/127/builds/1355/steps/14/logs/stdio

oe-selftest-armhost ubuntu2004-arm-1</thetext>
  </long_desc><long_desc isprivate="0" >
    <commentid>95699</commentid>
    <comment_count>21</comment_count>
    <who name="Alexandre Belloni">alexandre.belloni</who>
    <bug_when>2023-06-09 17:58:48 +0000</bug_when>
    <thetext>https://autobuilder.yoctoproject.org/typhoon/#/builders/80/builds/5202/steps/14/logs/stdio

oe-selftest-debian debian11-ty-2</thetext>
  </long_desc><long_desc isprivate="0" >
    <commentid>95794</commentid>
    <comment_count>22</comment_count>
    <who name="Luca Ceresoli">luca.ceresoli</who>
    <bug_when>2023-06-22 12:33:03 +0000</bug_when>
    <thetext>https://autobuilder.yoctoproject.org/typhoon/#/builders/87/builds/5408/steps/14/logs/stdio

oe-selftest-ubuntu on ubuntu2004-ty-1</thetext>
  </long_desc><long_desc isprivate="0" >
    <commentid>95933</commentid>
    <comment_count>23</comment_count>
    <who name="Alexandre Belloni">alexandre.belloni</who>
    <bug_when>2023-07-18 15:20:43 +0000</bug_when>
    <thetext>https://autobuilder.yoctoproject.org/typhoon/#/builders/127/builds/1510/steps/14/logs/stdio

oe-selftest-armhost ubuntu2004-arm-1</thetext>
  </long_desc><long_desc isprivate="0" >
    <commentid>95936</commentid>
    <comment_count>24</comment_count>
    <who name="Alexandre Belloni">alexandre.belloni</who>
    <bug_when>2023-07-18 16:00:27 +0000</bug_when>
    <thetext>https://autobuilder.yoctoproject.org/typhoon/#/builders/127/builds/1678/steps/14/logs/stdio

oe-selftest-armhost ubuntu2004-arm-1</thetext>
  </long_desc><long_desc isprivate="0" >
    <commentid>95939</commentid>
    <comment_count>25</comment_count>
    <who name="Alexandre Belloni">alexandre.belloni</who>
    <bug_when>2023-07-18 16:29:58 +0000</bug_when>
    <thetext>https://autobuilder.yoctoproject.org/typhoon/#/builders/80/builds/5418/steps/14/logs/stdio

oe-selftest-debian debian11-ty-1</thetext>
  </long_desc><long_desc isprivate="0" >
    <commentid>95963</commentid>
    <comment_count>26</comment_count>
    <who name="Alexandre Belloni">alexandre.belloni</who>
    <bug_when>2023-07-19 14:32:56 +0000</bug_when>
    <thetext>https://autobuilder.yoctoproject.org/typhoon/#/builders/127/builds/1649/steps/14/logs/stdio

oe-selftest-armhost ubuntu2004-arm-1</thetext>
  </long_desc><long_desc isprivate="0" >
    <commentid>95974</commentid>
    <comment_count>27</comment_count>
    <who name="Alexandre Belloni">alexandre.belloni</who>
    <bug_when>2023-07-19 17:12:02 +0000</bug_when>
    <thetext>https://autobuilder.yoctoproject.org/typhoon/#/builders/87/builds/5398/steps/14/logs/stdio

oe-selftest-ubuntu ubuntu2004-ty-1</thetext>
  </long_desc><long_desc isprivate="0" >
    <commentid>96000</commentid>
    <comment_count>28</comment_count>
    <who name="Alexandre Belloni">alexandre.belloni</who>
    <bug_when>2023-07-20 17:22:29 +0000</bug_when>
    <thetext>https://autobuilder.yoctoproject.org/typhoon/#/builders/80/builds/5451/steps/14/logs/stdio

oe-selftest-debian debian11-ty-1</thetext>
  </long_desc><long_desc isprivate="0" >
    <commentid>96004</commentid>
    <comment_count>29</comment_count>
    <who name="Alexandre Belloni">alexandre.belloni</who>
    <bug_when>2023-07-20 17:44:47 +0000</bug_when>
    <thetext>https://autobuilder.yoctoproject.org/typhoon/#/builders/127/builds/1590/steps/14/logs/stdio

oe-selftest-armhost ubuntu2004-arm-1</thetext>
  </long_desc><long_desc isprivate="0" >
    <commentid>96005</commentid>
    <comment_count>30</comment_count>
    <who name="Alexandre Belloni">alexandre.belloni</who>
    <bug_when>2023-07-20 17:59:10 +0000</bug_when>
    <thetext>https://autobuilder.yoctoproject.org/typhoon/#/builders/127/builds/1604/steps/14/logs/stdio

oe-selftest-armhost ubuntu2004-arm-1</thetext>
  </long_desc><long_desc isprivate="0" >
    <commentid>96006</commentid>
    <comment_count>31</comment_count>
    <who name="Alexandre Belloni">alexandre.belloni</who>
    <bug_when>2023-07-20 18:07:48 +0000</bug_when>
    <thetext>https://autobuilder.yoctoproject.org/typhoon/#/builders/127/builds/1600/steps/14/logs/stdio

oe-selftest-armhost ubuntu2004-arm-1</thetext>
  </long_desc><long_desc isprivate="0" >
    <commentid>96012</commentid>
    <comment_count>32</comment_count>
    <who name="Alexandre Belloni">alexandre.belloni</who>
    <bug_when>2023-07-20 22:26:41 +0000</bug_when>
    <thetext>https://autobuilder.yoctoproject.org/typhoon/#/builders/80/builds/5298/steps/14/logs/stdio

oe-selftest-debian debian11-ty-1</thetext>
  </long_desc><long_desc isprivate="0" >
    <commentid>96034</commentid>
    <comment_count>33</comment_count>
    <who name="Steve Sakoman">steve</who>
    <bug_when>2023-07-26 14:42:09 +0000</bug_when>
    <thetext>Two mickledore failures on same a-full run:

https://autobuilder.yoctoproject.org/typhoon/#/builders/79/builds/5521

oe-selftest-centos alma9-ty-1


https://autobuilder.yoctoproject.org/typhoon/#/builders/86/builds/5512

oe-selftest-fedora fedora38-ty-4</thetext>
  </long_desc><long_desc isprivate="0" >
    <commentid>96147</commentid>
    <comment_count>34</comment_count>
    <who name="Alexandre Belloni">alexandre.belloni</who>
    <bug_when>2023-07-31 20:37:27 +0000</bug_when>
    <thetext>https://autobuilder.yoctoproject.org/typhoon/#/builders/87/builds/5535/steps/14/logs/stdio

oe-selftest-ubuntu ubuntu2004-ty-1</thetext>
  </long_desc><long_desc isprivate="0" >
    <commentid>96159</commentid>
    <comment_count>35</comment_count>
    <who name="Alexandre Belloni">alexandre.belloni</who>
    <bug_when>2023-08-02 14:17:50 +0000</bug_when>
    <thetext>https://autobuilder.yoctoproject.org/typhoon/#/builders/127/builds/1804/steps/14/logs/stdio

oe-selftest-armhost ubuntu2004-arm-1</thetext>
  </long_desc><long_desc isprivate="0" >
    <commentid>96202</commentid>
    <comment_count>36</comment_count>
    <who name="Alexandre Belloni">alexandre.belloni</who>
    <bug_when>2023-08-07 10:19:51 +0000</bug_when>
    <thetext>https://autobuilder.yoctoproject.org/typhoon/#/builders/87/builds/5579/steps/14/logs/stdio

oe-selftest-ubuntu ubuntu2004-ty-1</thetext>
  </long_desc><long_desc isprivate="0" >
    <commentid>96219</commentid>
    <comment_count>37</comment_count>
    <who name="Alexandre Belloni">alexandre.belloni</who>
    <bug_when>2023-08-10 13:48:46 +0000</bug_when>
    <thetext>https://autobuilder.yoctoproject.org/typhoon/#/builders/80/builds/5521/steps/14/logs/stdio

oe-selftest-debian debian11-ty-3</thetext>
  </long_desc><long_desc isprivate="0" >
    <commentid>96221</commentid>
    <comment_count>38</comment_count>
    <who name="Alexandre Belloni">alexandre.belloni</who>
    <bug_when>2023-08-10 14:18:14 +0000</bug_when>
    <thetext>https://autobuilder.yoctoproject.org/typhoon/#/builders/80/builds/5527/steps/14/logs/stdio

oe-selftest-debian debian11-ty-3</thetext>
  </long_desc><long_desc isprivate="0" >
    <commentid>96274</commentid>
    <comment_count>39</comment_count>
    <who name="Alexandre Belloni">alexandre.belloni</who>
    <bug_when>2023-08-17 19:55:15 +0000</bug_when>
    <thetext>https://autobuilder.yoctoproject.org/typhoon/#/builders/56/builds/2319/steps/14/logs/stdio

debian11-ty-3</thetext>
  </long_desc><long_desc isprivate="0" >
    <commentid>96275</commentid>
    <comment_count>40</comment_count>
    <who name="Alexandre Belloni">alexandre.belloni</who>
    <bug_when>2023-08-17 19:59:35 +0000</bug_when>
    <thetext>https://autobuilder.yoctoproject.org/typhoon/#/builders/127/builds/1902/steps/14/logs/stdio

oe-selftest-armhost ubuntu2004-arm-1</thetext>
  </long_desc><long_desc isprivate="0" >
    <commentid>96304</commentid>
    <comment_count>41</comment_count>
    <who name="Luca Ceresoli">luca.ceresoli</who>
    <bug_when>2023-08-25 08:11:55 +0000</bug_when>
    <thetext>https://autobuilder.yoctoproject.org/typhoon/#/builders/80/builds/5595/steps/14/logs/stdio

oe-selftest-debian on debian11-ty-3</thetext>
  </long_desc><long_desc isprivate="0" >
    <commentid>96351</commentid>
    <comment_count>42</comment_count>
    <who name="Alexandre Belloni">alexandre.belloni</who>
    <bug_when>2023-09-07 14:26:19 +0000</bug_when>
    <thetext>https://autobuilder.yoctoproject.org/typhoon/#/builders/87/builds/5725/steps/14/logs/stdio

oe-selftest-ubuntu ubuntu2004-ty-1</thetext>
  </long_desc><long_desc isprivate="0" >
    <commentid>96352</commentid>
    <comment_count>43</comment_count>
    <who name="Alexandre Belloni">alexandre.belloni</who>
    <bug_when>2023-09-07 14:27:26 +0000</bug_when>
    <thetext>https://autobuilder.yoctoproject.org/typhoon/#/builders/80/builds/5653/steps/14/logs/stdio

oe-selftest-debian debian11-ty-1</thetext>
  </long_desc><long_desc isprivate="0" >
    <commentid>96382</commentid>
    <comment_count>44</comment_count>
    <who name="Alexandre Belloni">alexandre.belloni</who>
    <bug_when>2023-09-07 21:52:05 +0000</bug_when>
    <thetext>https://autobuilder.yoctoproject.org/typhoon/#/builders/80/builds/5577/steps/14/logs/stdio

oe-selftest-debian debian11-ty-1</thetext>
  </long_desc><long_desc isprivate="0" >
    <commentid>96503</commentid>
    <comment_count>45</comment_count>
    <who name="Steve Sakoman">steve</who>
    <bug_when>2023-09-14 19:09:59 +0000</bug_when>
    <thetext>mickledore:

https://autobuilder.yoctoproject.org/typhoon/#/builders/80/builds/5708

oe-selftest-debian debian11-ty-1</thetext>
  </long_desc><long_desc isprivate="0" >
    <commentid>96514</commentid>
    <comment_count>46</comment_count>
    <who name="Richard Purdie">richard.purdie</who>
    <bug_when>2023-09-18 12:53:41 +0000</bug_when>
    <thetext>*** Bug 14665 has been marked as a duplicate of this bug. ***</thetext>
  </long_desc><long_desc isprivate="0" >
    <commentid>96543</commentid>
    <comment_count>47</comment_count>
    <who name="Alexandre Belloni">alexandre.belloni</who>
    <bug_when>2023-09-21 16:47:44 +0000</bug_when>
    <thetext>https://autobuilder.yoctoproject.org/typhoon/#/builders/80/builds/5561/steps/14/logs/stdio

oe-selftest-debian debian11-ty-1</thetext>
  </long_desc><long_desc isprivate="0" >
    <commentid>96589</commentid>
    <comment_count>48</comment_count>
    <who name="Randy MacLeod">randy.macleod</who>
    <bug_when>2023-09-28 14:58:35 +0000</bug_when>
    <thetext>comment 33 is not relevant, it&apos;s a different bug.

Richard thinks that he has seen this on his own ubu-20.04 builder.</thetext>
  </long_desc><long_desc isprivate="0" >
    <commentid>96596</commentid>
    <comment_count>49</comment_count>
    <who name="Randy MacLeod">randy.macleod</who>
    <bug_when>2023-09-28 18:38:10 +0000</bug_when>
    <thetext>William (CCed now) will try to reproduce this issue over the coming week or so.</thetext>
  </long_desc><long_desc isprivate="0" >
    <commentid>96636</commentid>
    <comment_count>50</comment_count>
    <who name="Alexandre Belloni">alexandre.belloni</who>
    <bug_when>2023-10-05 20:39:52 +0000</bug_when>
    <thetext>https://autobuilder.yoctoproject.org/typhoon/#/builders/80/builds/5749/steps/14/logs/stdio

oe-selftest-debian debian11-ty-3</thetext>
  </long_desc><long_desc isprivate="0" >
    <commentid>96650</commentid>
    <comment_count>51</comment_count>
    <who name="Alexandre Belloni">alexandre.belloni</who>
    <bug_when>2023-10-05 22:03:34 +0000</bug_when>
    <thetext>https://autobuilder.yoctoproject.org/typhoon/#/builders/87/builds/5871/steps/14/logs/stdio

oe-selftest-ubuntu ubuntu2004-ty-1</thetext>
  </long_desc><long_desc isprivate="0" >
    <commentid>96774</commentid>
    <comment_count>52</comment_count>
    <who name="Luca Ceresoli">luca.ceresoli</who>
    <bug_when>2023-10-24 07:27:22 +0000</bug_when>
    <thetext>https://autobuilder.yoctoproject.org/typhoon/#/builders/87/builds/5969/steps/14/logs/stdio

oe-selftest-ubuntu on ubuntu2004-ty-1</thetext>
  </long_desc><long_desc isprivate="0" >
    <commentid>97012</commentid>
    <comment_count>53</comment_count>
    <who name="Luca Ceresoli">luca.ceresoli</who>
    <bug_when>2023-10-27 07:15:53 +0000</bug_when>
    <thetext>https://autobuilder.yoctoproject.org/typhoon/#/builders/127/builds/2335/steps/14/logs/stdio

oe-selftest-armhost on ubuntu2004-arm-1</thetext>
  </long_desc><long_desc isprivate="0" >
    <commentid>97281</commentid>
    <comment_count>54</comment_count>
    <who name="Steve Sakoman">steve</who>
    <bug_when>2023-11-20 16:18:43 +0000</bug_when>
    <thetext>nanbield:

https://autobuilder.yoctoproject.org/typhoon/#/builders/127/builds/2457/steps/14/logs/stdio
oe-selftest-armhost ubuntu2004-arm-1</thetext>
  </long_desc><long_desc isprivate="0" >
    <commentid>97333</commentid>
    <comment_count>55</comment_count>
    <who name="Steve Sakoman">steve</who>
    <bug_when>2023-11-25 21:38:38 +0000</bug_when>
    <thetext>nanbield:

https://autobuilder.yoctoproject.org/typhoon/#/builders/80/builds/6047/steps/14/logs/stdio
oe-selftest-debian debian11-ty-3

https://autobuilder.yoctoproject.org/typhoon/#/builders/87/builds/6112/steps/14/logs/stdio
oe-selftest-ubuntu ubuntu2004-ty-1</thetext>
  </long_desc><long_desc isprivate="0" >
    <commentid>97483</commentid>
    <comment_count>56</comment_count>
    <who name="Alexandre Belloni">alexandre.belloni</who>
    <bug_when>2023-12-10 00:08:28 +0000</bug_when>
    <thetext>https://autobuilder.yoctoproject.org/typhoon/#/builders/80/builds/5974/steps/14/logs/stdio

oe-selftest-debian debian11-ty-1</thetext>
  </long_desc><long_desc isprivate="0" >
    <commentid>97522</commentid>
    <comment_count>57</comment_count>
    <who name="Alexandre Belloni">alexandre.belloni</who>
    <bug_when>2023-12-11 23:29:46 +0000</bug_when>
    <thetext>https://autobuilder.yoctoproject.org/typhoon/#/builders/87/builds/5787/steps/14/logs/stdio

oe-selftest-ubuntu ubuntu2004-ty-1</thetext>
  </long_desc><long_desc isprivate="0" >
    <commentid>97524</commentid>
    <comment_count>58</comment_count>
    <who name="Alexandre Belloni">alexandre.belloni</who>
    <bug_when>2023-12-11 23:38:26 +0000</bug_when>
    <thetext>https://autobuilder.yoctoproject.org/typhoon/#/builders/127/builds/2303/steps/14/logs/stdio

oe-selftest-armhost ubuntu2004-arm-1</thetext>
  </long_desc><long_desc isprivate="0" >
    <commentid>97539</commentid>
    <comment_count>59</comment_count>
    <who name="Alexandre Belloni">alexandre.belloni</who>
    <bug_when>2023-12-12 09:33:37 +0000</bug_when>
    <thetext>https://autobuilder.yoctoproject.org/typhoon/#/builders/87/builds/5705/steps/14/logs/stdio

oe-selftest-ubuntu ubuntu2004-ty-1</thetext>
  </long_desc><long_desc isprivate="0" >
    <commentid>97727</commentid>
    <comment_count>60</comment_count>
    <who name="Richard Purdie">richard.purdie</who>
    <bug_when>2024-01-04 15:36:21 +0000</bug_when>
    <thetext>https://git.yoctoproject.org/poky/commit/bitbake/lib/bb?id=fe5d2f0b666c83e3336ea9962c8e2e4c39816e21</thetext>
  </long_desc><long_desc isprivate="0" >
    <commentid>100493</commentid>
    <comment_count>61</comment_count>
    <who name="Javier Tia">floss</who>
    <bug_when>2024-12-23 17:39:23 +0000</bug_when>
    <thetext>I am seeing this problem again. I am not sure what triggered it because I changed to a faster HW, upgraded Python to v3.13.1, and started using poky from master (commit: 284a08b6e4076).

I am not sure how to reproduce it because the failure is random. It looks like a concurrency problem.

Please let me know if I can provide more information.

I think this bug should be reopened.</thetext>
  </long_desc><long_desc isprivate="0" >
    <commentid>100503</commentid>
    <comment_count>62</comment_count>
    <who name="Richard Purdie">richard.purdie</who>
    <bug_when>2024-12-24 23:29:03 +0000</bug_when>
    <thetext>There are a lot of different reasons an issue like this could occur. Rather than reopen a bug which was tracked down to a specific issue, I&apos;d suggest opening a new one so that we can log the specific details of your situation.

In order to look into it in any detail we will need more information as there isn&apos;t enough to go on right now.

Are there any trackbacks in bitbake-cookerdaemon.log?

I&apos;m doubtful it is python 3.13 as mentioned elsewhere as we have autobuilder workers with python 3.13 on and it is working there.</thetext>
  </long_desc><long_desc isprivate="0" >
    <commentid>100504</commentid>
    <comment_count>63</comment_count>
    <who name="Javier Tia">floss</who>
    <bug_when>2024-12-24 23:34:17 +0000</bug_when>
    <thetext>OK. Returning it to the previous state. I will open a new one with more information. Thanks!</thetext>
  </long_desc>
      
      

    </bug>

</bugzilla>