<?xml version="1.0" encoding="UTF-8" standalone="yes" ?>
<!DOCTYPE bugzilla SYSTEM "https://bugzilla.yoctoproject.org/page.cgi?id=bugzilla.dtd">

<bugzilla version="5.0.6"
          urlbase="https://bugzilla.yoctoproject.org/"
          
          maintainer="it-coreprojects-helpdesk@linuxfoundation.org"
>

    <bug>
          <bug_id>15047</bug_id>
          
          <creation_ts>2023-02-28 16:36:22 +0000</creation_ts>
          <short_desc>AB-INT PTEST: python3 test_devnull_input failure</short_desc>
          <delta_ts>2023-06-15 14:57:48 +0000</delta_ts>
          <reporter_accessible>1</reporter_accessible>
          <cclist_accessible>1</cclist_accessible>
          <classification_id>10</classification_id>
          <classification>QA/Testing</classification>
          <product>Package Testing (ptest)</product>
          <component>ptest</component>
          <version>unspecified</version>
          <rep_platform>x86</rep_platform>
          <op_sys>Multiple</op_sys>
          <bug_status>RESOLVED</bug_status>
          <resolution>WORKSFORME</resolution>
          
          
          <bug_file_loc></bug_file_loc>
          <status_whiteboard>AB-INT</status_whiteboard>
          <keywords></keywords>
          <priority>Medium</priority>
          <bug_severity>normal</bug_severity>
          <target_milestone>4.3</target_milestone>
          
          
          <everconfirmed>1</everconfirmed>
          <reporter name="Alexandre Belloni">alexandre.belloni</reporter>
          <assigned_to name="Unassigned">unassigned</assigned_to>
          <cc>alexandre.belloni</cc>
    
    <cc>randy.macleod</cc>
    
    <cc>ross.burton</cc>
          
          
          <cf_os>---</cf_os>
          <cf_regression_type>---</cf_regression_type>
          
          <cf_docchange>No (bug/feature does not impact docs)</cf_docchange>

      

      

      

          <comment_sort_order>oldest_to_newest</comment_sort_order>  
          <long_desc isprivate="0" >
    <commentid>95021</commentid>
    <comment_count>0</comment_count>
    <who name="Alexandre Belloni">alexandre.belloni</who>
    <bug_when>2023-02-28 16:36:22 +0000</bug_when>
    <thetext>&apos;python3&apos;: [&apos;test_devnull_input&apos;]}

======================================================================
FAIL: test_devnull_input (test.test_asyncio.test_subprocess.SubprocessThreadedWatcherTests.test_devnull_input)
----------------------------------------------------------------------
Traceback (most recent call last):
  File &quot;/usr/lib/python3.11/test/test_asyncio/test_subprocess.py&quot;, line 392, in test_devnull_input
    self.assertEqual(output.rstrip(), b&apos;0&apos;)
AssertionError: b&apos;&apos; != b&apos;0&apos;

----------------------------------------------------------------------
Ran 2339 tests in 172.016s

FAILED (failures=1, skipped=47)
test test_asyncio failed</thetext>
  </long_desc><long_desc isprivate="0" >
    <commentid>95022</commentid>
    <comment_count>1</comment_count>
    <who name="Alexandre Belloni">alexandre.belloni</who>
    <bug_when>2023-02-28 16:37:10 +0000</bug_when>
    <thetext>https://autobuilder.yoctoproject.org/typhoon/#/builders/82/builds/4396/steps/12/logs/stdio</thetext>
  </long_desc><long_desc isprivate="0" >
    <commentid>95739</commentid>
    <comment_count>2</comment_count>
    <who name="Randy MacLeod">randy.macleod</who>
    <bug_when>2023-06-15 14:57:48 +0000</bug_when>
    <thetext>Only seen once, in Jan/Feb 2023.
Re-open if seen again.</thetext>
  </long_desc>
      
      

    </bug>

</bugzilla>