<?xml version="1.0" encoding="UTF-8" standalone="yes" ?>
<!DOCTYPE bugzilla SYSTEM "https://bugzilla.yoctoproject.org/page.cgi?id=bugzilla.dtd">

<bugzilla version="5.0.6"
          urlbase="https://bugzilla.yoctoproject.org/"
          
          maintainer="it-coreprojects-helpdesk@linuxfoundation.org"
>

    <bug>
          <bug_id>15079</bug_id>
          
          <creation_ts>2023-03-23 14:26:34 +0000</creation_ts>
          <short_desc>AB-INT PTEST: strace count ptest failure</short_desc>
          <delta_ts>2026-10-16 16:46:06 +0000</delta_ts>
          <reporter_accessible>1</reporter_accessible>
          <cclist_accessible>1</cclist_accessible>
          <classification_id>10</classification_id>
          <classification>QA/Testing</classification>
          <product>Package Testing (ptest)</product>
          <component>ptest</component>
          <version>unspecified</version>
          <rep_platform>x86</rep_platform>
          <op_sys>Multiple</op_sys>
          <bug_status>ACCEPTED</bug_status>
          <resolution></resolution>
          
          
          <bug_file_loc></bug_file_loc>
          <status_whiteboard>AB-INT</status_whiteboard>
          <keywords></keywords>
          <priority>Medium</priority>
          <bug_severity>normal</bug_severity>
          <target_milestone>6.2</target_milestone>
          
          
          <everconfirmed>1</everconfirmed>
          <reporter name="Alexandre Belloni">alexandre.belloni</reporter>
          <assigned_to name="Kris Gavvala">kris.gavvala</assigned_to>
          <cc>alexandre.belloni</cc>
    
    <cc>Derald.Woods</cc>
    
    <cc>joaomarcos.costa</cc>
    
    <cc>randy.macleod</cc>
    
    <cc>tgamblin</cc>
          
          
          <cf_os>---</cf_os>
          <cf_regression_type>---</cf_regression_type>
          
          <cf_docchange>No (bug/feature does not impact docs)</cf_docchange>

      

      

      

          <comment_sort_order>oldest_to_newest</comment_sort_order>  
          <long_desc isprivate="0" >
    <commentid>95184</commentid>
    <comment_count>0</comment_count>
    <who name="Alexandre Belloni">alexandre.belloni</who>
    <bug_when>2023-03-23 14:26:34 +0000</bug_when>
    <thetext>https://autobuilder.yoctoproject.org/typhoon/#/builders/82/builds/4619/steps/13/logs/stdio

&apos;strace&apos;: [&apos;count.test&apos;, &apos;count&apos;]


FAIL: count
===========

Pattern of expected output: 100\.00 +(1\.[01]|0\.99)[^n]*nanosleep
Actual output:
% time     seconds  usecs/call     calls    errors syscall
------ ----------- ----------- --------- --------- ----------------
100.00    1.319801     1319800         1           nanosleep
------ ----------- ----------- --------- --------- ----------------
100.00    1.319801     1319800         1           total
count.test: failed test: ../../src/strace -cw -enanosleep ../sleep 1 output mismatch
FAIL count.test (exit status: 1)</thetext>
  </long_desc><long_desc isprivate="0" >
    <commentid>95919</commentid>
    <comment_count>1</comment_count>
    <who name="Randy MacLeod">randy.macleod</who>
    <bug_when>2023-07-13 14:54:06 +0000</bug_when>
    <thetext>Randy should send a patch to increase the time allowed.</thetext>
  </long_desc><long_desc isprivate="0" >
    <commentid>96140</commentid>
    <comment_count>2</comment_count>
    <who name="Alexandre Belloni">alexandre.belloni</who>
    <bug_when>2023-07-28 13:22:41 +0000</bug_when>
    <thetext>https://autobuilder.yoctoproject.org/typhoon/#/builders/82/builds/5208/steps/13/logs/stdio

qemuarm64-ptest ubuntu1804-arm-1</thetext>
  </long_desc><long_desc isprivate="0" >
    <commentid>96421</commentid>
    <comment_count>3</comment_count>
    <who name="Trevor Gamblin">tgamblin</who>
    <bug_when>2023-09-14 15:34:03 +0000</bug_when>
    <thetext>Moved to M4.</thetext>
  </long_desc><long_desc isprivate="0" >
    <commentid>98037</commentid>
    <comment_count>4</comment_count>
    <who name="Randy MacLeod">randy.macleod</who>
    <bug_when>2024-01-25 15:53:15 +0000</bug_when>
    <thetext>Infrequent but I&apos;d like to review the test. Lower to Medium.</thetext>
  </long_desc><long_desc isprivate="0" >
    <commentid>98743</commentid>
    <comment_count>5</comment_count>
    <who name="João Marcos Costa">joaomarcos.costa</who>
    <bug_when>2024-04-12 09:42:12 +0000</bug_when>
    <thetext>https://autobuilder.yoctoproject.org/typhoon/#/builders/82/builds/6298/steps/13/logs/stdio

AssertionError: 
Failed ptests:
{&apos;strace&apos;: [&apos;count.test&apos;, &apos;count&apos;]}</thetext>
  </long_desc><long_desc isprivate="0" >
    <commentid>98769</commentid>
    <comment_count>6</comment_count>
    <who name="João Marcos Costa">joaomarcos.costa</who>
    <bug_when>2024-04-23 11:01:48 +0000</bug_when>
    <thetext>https://autobuilder.yoctoproject.org/typhoon/#/builders/82/builds/6343/steps/13/logs/stdio

AssertionError: 
Failed ptests:
{&apos;strace&apos;: [&apos;count.test&apos;, &apos;count&apos;]}

qemuarm64-ptest ubuntu1804-arm-1</thetext>
  </long_desc><long_desc isprivate="0" >
    <commentid>99698</commentid>
    <comment_count>7</comment_count>
    <who name="Randy MacLeod">randy.macleod</who>
    <bug_when>2024-09-23 18:46:35 +0000</bug_when>
    <thetext>Re-open if seen again.</thetext>
  </long_desc><long_desc isprivate="0" >
    <commentid>101385</commentid>
    <comment_count>8</comment_count>
    <who name="João Marcos Costa">joaomarcos.costa</who>
    <bug_when>2025-03-17 09:25:28 +0000</bug_when>
    <thetext>https://autobuilder.yoctoproject.org/valkyrie/#/builders/73/builds/1111/steps/12/logs/stdio

AssertionError: Failed ptests:{&apos;strace&apos;: [&apos;count.test&apos;, &apos;count&apos;]}

qemux86-64-ptest fedora40-vk-4

Reopening.</thetext>
  </long_desc><long_desc isprivate="0" >
    <commentid>101450</commentid>
    <comment_count>9</comment_count>
    <who name="João Marcos Costa">joaomarcos.costa</who>
    <bug_when>2025-03-21 09:23:35 +0000</bug_when>
    <thetext>https://autobuilder.yoctoproject.org/valkyrie/#/builders/73/builds/1161/steps/12/logs/stdio

qemux86-64-ptest alma9-vk-1</thetext>
  </long_desc><long_desc isprivate="0" >
    <commentid>103462</commentid>
    <comment_count>10</comment_count>
    <who name="Randy MacLeod">randy.macleod</who>
    <bug_when>2025-12-03 01:26:48 +0000</bug_when>
    <thetext>If this happens during 6.0 development, Randy should change:
❯ rg WALLCLOCK= tests/count.test
33:WALLCLOCK=&apos; *[^ ]+ +(1\.[01]|0\.99)[^n]*nanosleep *&apos;

to be:

33:WALLCLOCK=&apos; *[^ ]+ +([1-3]\.[01]|0\.99)[^n]*nanosleep *&apos;

or something.</thetext>
  </long_desc><long_desc isprivate="0" >
    <commentid>105405</commentid>
    <comment_count>11</comment_count>
    <who name="Mathieu Dubois-Briand">mathieu.dubois-briand</who>
    <bug_when>2026-05-11 08:54:21 +0000</bug_when>
    <thetext>qemuarm64-ptest ubuntu2204-vk-arm2 mathieu/master-next completed at 2026-05-10 12:18:17+00:00
https://valkyrie.yocto.io/pub/non-release/20260510-42/testresults/qemuarm64-ptest/
https://autobuilder.yoctoproject.org/valkyrie/#/builders/61/builds/3630/steps/13/logs/stdio</thetext>
  </long_desc>
      
      

    </bug>

</bugzilla>