<?xml version="1.0" encoding="UTF-8" standalone="yes" ?>
<!DOCTYPE bugzilla SYSTEM "https://bugzilla.yoctoproject.org/page.cgi?id=bugzilla.dtd">

<bugzilla version="5.0.6"
          urlbase="https://bugzilla.yoctoproject.org/"
          
          maintainer="it-coreprojects-helpdesk@linuxfoundation.org"
>

    <bug>
          <bug_id>15131</bug_id>
          
          <creation_ts>2023-06-01 16:23:19 +0000</creation_ts>
          <short_desc>AB-INT PTEST ARM: python3 &apos;Test_wait&apos;, &apos;test_timeout&apos; failure</short_desc>
          <delta_ts>2023-08-10 14:52:05 +0000</delta_ts>
          <reporter_accessible>1</reporter_accessible>
          <cclist_accessible>1</cclist_accessible>
          <classification_id>10</classification_id>
          <classification>QA/Testing</classification>
          <product>Package Testing (ptest)</product>
          <component>ptest</component>
          <version>unspecified</version>
          <rep_platform>x86</rep_platform>
          <op_sys>Multiple</op_sys>
          <bug_status>RESOLVED</bug_status>
          <resolution>FIXED</resolution>
          
          
          <bug_file_loc></bug_file_loc>
          <status_whiteboard>AB-INT</status_whiteboard>
          <keywords></keywords>
          <priority>Medium</priority>
          <bug_severity>normal</bug_severity>
          <target_milestone>4.3</target_milestone>
          
          
          <everconfirmed>1</everconfirmed>
          <reporter name="Alexandre Belloni">alexandre.belloni</reporter>
          <assigned_to name="Trevor Gamblin">tgamblin</assigned_to>
          <cc>alexandre.belloni</cc>
    
    <cc>randy.macleod</cc>
    
    <cc>tim.orling</cc>
          
          
          <cf_os>---</cf_os>
          <cf_regression_type>---</cf_regression_type>
          
          <cf_docchange>No (bug/feature does not impact docs)</cf_docchange>

      

      

      

          <comment_sort_order>oldest_to_newest</comment_sort_order>  
          <long_desc isprivate="0" >
    <commentid>95616</commentid>
    <comment_count>0</comment_count>
    <who name="Alexandre Belloni">alexandre.belloni</who>
    <bug_when>2023-06-01 16:23:19 +0000</bug_when>
    <thetext>https://autobuilder.yoctoproject.org/typhoon/#/builders/82/builds/4808/steps/13/logs/stdio

qemuarm64-ptest ubuntu1804-arm-1

======================================================================
FAIL: test_timeout (test.test_multiprocessing_forkserver.WithManagerTestBarrier.test_timeout)
Test wait(timeout)
----------------------------------------------------------------------
Traceback (most recent call last):
  File &quot;/usr/lib/python3.11/test/_test_multiprocessing.py&quot;, line 2013, in test_timeout
    self.assertEqual(len(results), self.barrier.parties)
AssertionError: 0 != 5

----------------------------------------------------------------------
Ran 375 tests in 103.356s

FAILED (failures=1, skipped=36)</thetext>
  </long_desc><long_desc isprivate="0" >
    <commentid>95658</commentid>
    <comment_count>1</comment_count>
    <who name="Tim Orling">tim.orling</who>
    <bug_when>2023-06-08 14:45:19 +0000</bug_when>
    <thetext>I believe this is the specific test case:
https://github.com/python/cpython/blob/3.11/Lib/test/_test_multiprocessing.py#L2006</thetext>
  </long_desc><long_desc isprivate="0" >
    <commentid>96182</commentid>
    <comment_count>2</comment_count>
    <who name="Randy MacLeod">randy.macleod</who>
    <bug_when>2023-08-03 14:54:34 +0000</bug_when>
    <thetext>If it&apos;s a timeout, please put it on a disabled list.</thetext>
  </long_desc><long_desc isprivate="0" >
    <commentid>96232</commentid>
    <comment_count>3</comment_count>
    <who name="Trevor Gamblin">tgamblin</who>
    <bug_when>2023-08-10 14:52:05 +0000</bug_when>
    <thetext>Patch merged that should fix this: https://git.yoctoproject.org/poky/commit/?id=e56b895866c941a71fd495727e360c534b5c9898</thetext>
  </long_desc>
      
      

    </bug>

</bugzilla>