<?xml version="1.0" encoding="UTF-8" standalone="yes" ?>
<!DOCTYPE bugzilla SYSTEM "https://bugzilla.yoctoproject.org/page.cgi?id=bugzilla.dtd">

<bugzilla version="5.0.6"
          urlbase="https://bugzilla.yoctoproject.org/"
          
          maintainer="it-coreprojects-helpdesk@linuxfoundation.org"
>

    <bug>
          <bug_id>15141</bug_id>
          
          <creation_ts>2023-06-08 21:22:23 +0000</creation_ts>
          <short_desc>AB-INT PTEST ARM: python test_thread_time ptest failure</short_desc>
          <delta_ts>2023-09-28 18:31:01 +0000</delta_ts>
          <reporter_accessible>1</reporter_accessible>
          <cclist_accessible>1</cclist_accessible>
          <classification_id>10</classification_id>
          <classification>QA/Testing</classification>
          <product>Package Testing (ptest)</product>
          <component>ptest</component>
          <version>unspecified</version>
          <rep_platform>x86</rep_platform>
          <op_sys>Multiple</op_sys>
          <bug_status>RESOLVED</bug_status>
          <resolution>DUPLICATE</resolution>
          <dup_id>15177</dup_id>
          
          <bug_file_loc></bug_file_loc>
          <status_whiteboard>AB-INT</status_whiteboard>
          <keywords></keywords>
          <priority>Medium+</priority>
          <bug_severity>normal</bug_severity>
          <target_milestone>4.3 M4</target_milestone>
          
          
          <everconfirmed>1</everconfirmed>
          <reporter name="Alexandre Belloni">alexandre.belloni</reporter>
          <assigned_to name="Trevor Gamblin">tgamblin</assigned_to>
          <cc>alexandre.belloni</cc>
    
    <cc>randy.macleod</cc>
          
          
          <cf_os>---</cf_os>
          <cf_regression_type>---</cf_regression_type>
          
          <cf_docchange>No (bug/feature does not impact docs)</cf_docchange>

      

      

      

          <comment_sort_order>oldest_to_newest</comment_sort_order>  
          <long_desc isprivate="0" >
    <commentid>95682</commentid>
    <comment_count>0</comment_count>
    <who name="Alexandre Belloni">alexandre.belloni</who>
    <bug_when>2023-06-08 21:22:23 +0000</bug_when>
    <thetext>https://autobuilder.yoctoproject.org/typhoon/#/builders/82/builds/4910/steps/13/logs/stdio

qemuarm64-ptest ubuntu1804-arm-1</thetext>
  </long_desc><long_desc isprivate="0" >
    <commentid>95683</commentid>
    <comment_count>1</comment_count>
    <who name="Alexandre Belloni">alexandre.belloni</who>
    <bug_when>2023-06-08 21:24:30 +0000</bug_when>
    <thetext>======================================================================
FAIL: test_thread_time (test.test_time.TimeTestCase.test_thread_time)
----------------------------------------------------------------------
Traceback (most recent call last):
  File &quot;/usr/lib/python3.11/test/test_time.py&quot;, line 523, in test_thread_time
    self.assertLess(stop - start, 0.020)
AssertionError: 0.1065535400000499 not less than 0.02

----------------------------------------------------------------------
Ran 59 tests in 2.108s

FAILED (failures=1, skipped=3)
test test_time failed
0:41:07 load avg: 0.70 [360/431/3] test_timeit -- test_time failed (1 failure)</thetext>
  </long_desc><long_desc isprivate="0" >
    <commentid>95726</commentid>
    <comment_count>2</comment_count>
    <who name="Ross Burton">ross.burton</who>
    <bug_when>2023-06-15 14:36:51 +0000</bug_when>
    <thetext>Probably a time-sensitive test, if so we should just skip it.</thetext>
  </long_desc><long_desc isprivate="0" >
    <commentid>96594</commentid>
    <comment_count>3</comment_count>
    <who name="Trevor Gamblin">tgamblin</who>
    <bug_when>2023-09-28 18:31:01 +0000</bug_when>
    <thetext>Fixed in https://git.yoctoproject.org/poky/commit/?id=e56b895866c941a71fd495727e360c534b5c9898

*** This bug has been marked as a duplicate of bug 15177 ***</thetext>
  </long_desc>
      
      

    </bug>

</bugzilla>