<?xml version="1.0" encoding="UTF-8" standalone="yes" ?>
<!DOCTYPE bugzilla SYSTEM "https://bugzilla.yoctoproject.org/page.cgi?id=bugzilla.dtd">

<bugzilla version="5.0.6"
          urlbase="https://bugzilla.yoctoproject.org/"
          
          maintainer="it-coreprojects-helpdesk@linuxfoundation.org"
>

    <bug>
          <bug_id>15163</bug_id>
          
          <creation_ts>2023-07-18 17:28:04 +0000</creation_ts>
          <short_desc>AB-INT PTEST: python3 test_create_connection_local_addr_nomatch_family failure</short_desc>
          <delta_ts>2024-01-25 16:30:55 +0000</delta_ts>
          <reporter_accessible>1</reporter_accessible>
          <cclist_accessible>1</cclist_accessible>
          <classification_id>10</classification_id>
          <classification>QA/Testing</classification>
          <product>Package Testing (ptest)</product>
          <component>ptest</component>
          <version>unspecified</version>
          <rep_platform>x86</rep_platform>
          <op_sys>Multiple</op_sys>
          <bug_status>RESOLVED</bug_status>
          <resolution>FIXED</resolution>
          
          
          <bug_file_loc></bug_file_loc>
          <status_whiteboard>AB-INT</status_whiteboard>
          <keywords></keywords>
          <priority>Medium</priority>
          <bug_severity>normal</bug_severity>
          <target_milestone>5.0</target_milestone>
          
          
          <everconfirmed>1</everconfirmed>
          <reporter name="Alexandre Belloni">alexandre.belloni</reporter>
          <assigned_to name="Unassigned">unassigned</assigned_to>
          <cc>alexandre.belloni</cc>
    
    <cc>joaomarcos.costa</cc>
    
    <cc>randy.macleod</cc>
          
          
          <cf_os>---</cf_os>
          <cf_regression_type>---</cf_regression_type>
          
          <cf_docchange>No (bug/feature does not impact docs)</cf_docchange>

      

      

      

          <comment_sort_order>oldest_to_newest</comment_sort_order>  
          <long_desc isprivate="0" >
    <commentid>95940</commentid>
    <comment_count>0</comment_count>
    <who name="Alexandre Belloni">alexandre.belloni</who>
    <bug_when>2023-07-18 17:28:04 +0000</bug_when>
    <thetext>https://autobuilder.yoctoproject.org/typhoon/#/builders/82/builds/5147/steps/12/logs/stdio

qemuarm64-ptest ubuntu2004-arm-1


======================================================================
FAIL: test_create_connection_local_addr_nomatch_family (test.test_asyncio.test_events.SelectEventLoopTests.test_create_connection_local_addr_nomatch_family)
----------------------------------------------------------------------
Traceback (most recent call last):
  File &quot;/usr/lib/python3.11/test/test_asyncio/test_events.py&quot;, line 712, in test_create_connection_local_addr_nomatch_family
    with self.assertRaises(OSError):
AssertionError: OSError not raised

----------------------------------------------------------------------
Ran 2355 tests in 133.917s

FAILED (failures=1, skipped=48)
test test_asyncio failed</thetext>
  </long_desc><long_desc isprivate="0" >
    <commentid>97157</commentid>
    <comment_count>1</comment_count>
    <who name="Randy MacLeod">randy.macleod</who>
    <bug_when>2023-10-30 15:37:32 +0000</bug_when>
    <thetext>Build move to 5.0 -- ../Randy</thetext>
  </long_desc><long_desc isprivate="0" >
    <commentid>97842</commentid>
    <comment_count>2</comment_count>
    <who name="João Marcos Costa">joaomarcos.costa</who>
    <bug_when>2024-01-17 13:28:55 +0000</bug_when>
    <thetext>https://autobuilder.yoctoproject.org/typhoon/#/builders/81/builds/5849/steps/12/logs/stdio

qemux86-64-ptest fedora38-ty-5</thetext>
  </long_desc><long_desc isprivate="0" >
    <commentid>98043</commentid>
    <comment_count>3</comment_count>
    <who name="Alexandre Belloni">alexandre.belloni</who>
    <bug_when>2024-01-25 16:30:55 +0000</bug_when>
    <thetext>Did not happen for 3 months</thetext>
  </long_desc>
      
      

    </bug>

</bugzilla>